{"text_format":"1","workbook":"xlsx","n_sheets":110,"sheets":["Totaaloverzicht","Ad Schellekens","André Abdoella","Annie Liebrand","Anne-Louise Westelaken","Antoinette Brok","Antoon van Mil","Bart Blatter","Bas Peters","Ben Kok","Bep Bosters","Bernard van der Wielen","Casper Westelaken","Chantal Stuiver","Christ van Esch","Clara van Kessel","Clemens de Mol","Coby Hendriks","Coen van den Bogaard","Cor Geerts","Corrie van Mil - de Looijer","Denice Sprengers","Dewi van Maaren","Dick van Huijstee","Diny Lommers","Diny van de Weijenberg","Driss Lamjaata","Ed van de Braak","Ed van der Burgh","Els Kuijpers - Hermsen","Enn Tulkens","Evy Pappot","Fien Bertrums","Franka van Aerle","Frans Baert","Fred Eskens","Geert Hollander","Gerard van der Loo","Gert Hagemans","Hans Fleuren","Hans van Woerkum","Harm Schilders","Henk Hermes","Henk Kuijs","Ilse van Mil","Ineke Poort","Iris Vriend","Jaap Faber","Jacques Tulkens","Jan Rovers","Jan van den Akker","Jan van Alebeek","Jan van den Broek","Jan Wijnhoven","Jilali Hasnaoui","John den Houter","John Kuijpers","Jonne Schophuizen","Jos de Kort","José van den Broek","Jürgen Cools","Lenie van Triest - Guijt","Leo Leenders","Lia Jansen","Loek Zweekhorst","Maik van Zutphen","Mari van Kessel","Maria de Zwart","Maria Grove","Marleen Kampert","Martha Clement","Maurice Maas","Mecheline Heijmans","Mels van der Doelen","Mieke Lakwijk","Mien van Tilburg","Mohammed Nazih","Mohammed Serraji","Monique van Steeden","Mustafa El Amouri","Mustapha Soussi","Paul van den Merkhof","Peggy Roelofsen","Pepijn de Leeuwen","Peter Ondersteijn","Petra Schepers","Phil Roothans","Pierre Kisters","Raymond Nijsten","Ria de Kort","Riet Geerts","Rikie van der Laar","Rikkie van der Wielen","Ronald Schoo","Roy van de Brink","Ruud van Hintum","Sjan Ondersteijn","Sylvester …","Tara van der Heijden","Theo Craane","Tijs Verbruggen","Tiny Heijmans","Tiny Smits","Ton van der Wel","Ton van Huijstee","Vera Beunk - Veeken","Willem Hartman","Willem Warnaar","Willy van der Wielen","xxx"],"not_rendered":{"charts":0,"images":4,"macros":1,"external_links":0,"defined_names":1420,"comments":0,"pivot_tables":0},"unopened":[],"bounds":{"document_bytes":16777216,"sheet_cells":100000,"rows_first":2000,"rows_last":500,"rows_between":2000,"halvings":0,"cell_chars":16384,"cell_head_chars":4096},"cells_cut":0,"cells_raw":0,"read":"whole","date_system":"1900"}

{"sheet":"Totaaloverzicht","index":0,"n_rows":136,"n_cols":13,"rows_kept":136,"cut":false,"hidden":false,"merged":[[16,1,16,12],[17,1,17,12],[134,1,134,12],[135,1,135,12],[19,1,21,12]]}
[]
[]
[]
[]
[]
[]
[]
[]
[]
[]
[]
[]
[null,"Uitslagen 'Bossche Boules 2021'"]
[null,"Laatste wijziging: 8-7-2021"]
[]
[]
[null,"Bepaling finalisten per wijktoernooi"]
[null,"Bij winst (lees: het is 13 of men staat voor als er wordt 'afgefloten') krijgt een speler 3 punten, bij gelijkspel 2 punten en bij verlies 0 punten. Door op één avond 3 partijen te winnen kan een speler dus maximaal 9 punten behalen. Daarnaast worden de saldopunten van alle wedstrijden opgeteld om een eindrangschikking mogelijk te maken.\nAlleen de spelers die van de in totaal 12 wedstrijden (lees: 4 avonden) tenminste 6 wedstrijden (lees: 2 avonden) hebben gespeeld maken kans om namens hun wijk de finale op de Bossche Parade te spelen. De uitslagen van deze spelers worden omgeslagen naar percentages op basis waarvan de eindrangschikking plaatsvindt. De finale wordt gespeeld op woensdagavond 14 juli 2021.\nOver uitslagen kan niet worden gecorrespondeerd."]
[]
[null,"LET OP: alleen wedstrijden die daadwerkelijk gespeeld zijn in de wijk waarvoor jij je hebt ingeschreven tellen mee (en worden hieronder getoond)!"]
[]
[]
[]
[null,"Naam","Wijk van initiële inschrijving\n(met shirtkleur finaledag)","Gespeeld","Gewonnen","Gewonnen","Verloren","% gewonnen","% gelijk","% verloren","Wedstrijd-punten","Saldo-punten","Saldo-punten per wedstrijd"]
[null,"Ad Schellekens",{"$f":"IF(B25=\"\",\"-\",IF(INDIRECT(CONCATENATE(\"'\",B25,\"'!wijk_van_inschrijving\"))=\"\",\"-\",INDIRECT(CONCATENATE(\"'\",B25,\"'!wijk_van_inschrijving\"))))","v":"De Hambaken"},{"$f":"IF(B25=\"\",\"-\",INDIRECT(CONCATENATE(\"'\",B25,\"'!gespeeld\")))","v":6},{"$f":"IF(B25=\"\",\"-\",INDIRECT(CONCATENATE(\"'\",B25,\"'!gewonnen\")))","v":3},{"$f":"IF(B25=\"\",\"-\",INDIRECT(CONCATENATE(\"'\",B25,\"'!gelijk\")))","v":0},{"$f":"IF(B25=\"\",\"-\",INDIRECT(CONCATENATE(\"'\",B25,\"'!verloren\")))","v":3},{"$f":"IF(B25=\"\",\"-\",INDIRECT(CONCATENATE(\"'\",B25,\"'!perc_gewonnen\")))","v":0.5},{"$f":"IF(B25=\"\",\"-\",INDIRECT(CONCATENATE(\"'\",B25,\"'!perc_gelijk\")))","v":0},{"$f":"IF(B25=\"\",\"-\",INDIRECT(CONCATENATE(\"'\",B25,\"'!perc_verloren\")))","v":0.5},{"$f":"IF(B25=\"\",\"-\",INDIRECT(CONCATENATE(\"'\",B25,\"'!wedstrijdpunten\")))","v":9},{"$f":"IF(B25=\"\",\"-\",INDIRECT(CONCATENATE(\"'\",B25,\"'!saldopunten\")))","v":-6},{"$f":"IF(B25=\"\",\"-\",INDIRECT(CONCATENATE(\"'\",B25,\"'!saldopunten_per_wedstrijd\")))","v":-1}]
[null,"André Abdoella","'s-Hertogenbosch Zuid",12,10,0,2,0.83333333333333337,0,0.16666666666666666,30,56,4.666666666666667]
[null,"Annie Liebrand","'s-Hertogenbosch Zuid",12,5,0,7,0.41666666666666669,0,0.58333333333333337,15,-30,-2.5]
[null,"Anne-Louise Westelaken","Hondsberg (Rosmalen)",3,1,0,2,0.33333333333333331,0,0.66666666666666663,3,-6,-2]
[null,"Antoinette Brok","De Schutskamp",5,4,1,0,0.8,0.2,0,14,30,6]
[null,"Antoon van Mil","'s-Hertogenbosch Zuid",5,2,0,3,0.4,0,0.6,6,7,1.4]
[null,"Bart Blatter","De Schutskamp",3,1,0,2,0.33333333333333331,0,0.66666666666666663,3,-10,-3.3333333333333335]
[null,"Bas Peters","De Schutskamp",2,1,0,1,0.5,0,0.5,3,0,0]
[null,"Ben Kok","De Schutskamp",9,3,2,4,0.33333333333333331,0.22222222222222221,0.44444444444444442,13,-11,-1.2222222222222223]
[null,"Bep Bosters","De Schutskamp",3,2,0,1,0.66666666666666663,0,0.33333333333333331,6,10,3.3333333333333335]
[null,"Bernard van der Wielen","De Schutskamp",1,1,0,0,1,0,0,3,10,10]
[null,"Casper Westelaken","Hondsberg (Rosmalen)",3,0,0,3,0,0,1,0,-11,-3.6666666666666665]
[null,"Chantal Stuiver","Hondsberg (Rosmalen)",2,1,0,1,0.5,0,0.5,3,1,0.5]
[null,"Christ van Esch","'s-Hertogenbosch Zuid",3,2,0,1,0.66666666666666663,0,0.33333333333333331,6,11,3.6666666666666665]
[null,"Clara van Kessel","'s-Hertogenbosch Zuid",3,0,0,3,0,0,1,0,-24,-8]
[null,"Clemens de Mol","'s-Hertogenbosch Zuid",3,0,1,2,0,0.33333333333333331,0.66666666666666663,2,-24,-8]
[null,"Coby Hendriks","De Schutskamp",12,1,0,11,8.3333333333333329E-2,0,0.91666666666666663,3,-74,-6.166666666666667]
[null,"Coen van den Bogaard","De Hambaken",3,0,0,3,0,0,1,0,-13,-4.333333333333333]
[null,"Cor Geerts","Hondsberg (Rosmalen)",8,3,0,5,0.375,0,0.625,9,1,0.125]
[null,"Corrie van Mil - de Looijer","De Schutskamp",9,8,1,0,0.88888888888888884,0.1111111111111111,0,26,36,4]
[null,"Denice Sprengers","'s-Hertogenbosch Zuid",1,0,0,1,0,0,1,0,-13,-13]
[null,"Dewi van Maaren","De Schutskamp",3,0,1,2,0,0.33333333333333331,0.66666666666666663,2,-6,-2]
[null,"Dick van Huijstee","De Hambaken",3,3,0,0,1,0,0,9,7,2.3333333333333335]
[null,"Diny Lommers","De Schutskamp",9,2,0,7,0.22222222222222221,0,0.77777777777777779,6,-14,-1.5555555555555556]
[null,"Diny van de Weijenberg","De Schutskamp",6,1,0,5,0.16666666666666666,0,0.83333333333333337,3,-51,-8.5]
[null,"Driss Lamjaata","De Schutskamp",12,5,0,7,0.41666666666666669,0,0.58333333333333337,15,-18,-1.5]
[null,"Ed van de Braak","'s-Hertogenbosch Zuid",1,0,0,1,0,0,1,0,-9,-9]
[null,"Ed van der Burgh","De Hambaken",12,7,0,5,0.58333333333333337,0,0.41666666666666669,21,16,1.3333333333333333]
[null,"Els Kuijpers - Hermsen","De Schutskamp",3,1,1,1,0.33333333333333331,0.33333333333333331,0.33333333333333331,5,1,0.33333333333333331]
[null,"Enn Tulkens","'s-Hertogenbosch Zuid",3,2,0,1,0.66666666666666663,0,0.33333333333333331,6,2,0.66666666666666663]
[null,"Evy Pappot","De Hambaken",4,1,0,3,0.25,0,0.75,3,-16,-4]
[null,"Fien Bertrums","'s-Hertogenbosch Zuid",6,0,0,6,0,0,1,0,-39,-6.5]
[null,"Franka van Aerle",{"$f":"IF(B57=\"\",\"-\",IF(INDIRECT(CONCATENATE(\"'\",B57,\"'!wijk_van_inschrijving\"))=\"\",\"-\",INDIRECT(CONCATENATE(\"'\",B57,\"'!wijk_van_inschrijving\"))))","v":"De Hambaken"},{"$f":"IF(B57=\"\",\"-\",INDIRECT(CONCATENATE(\"'\",B57,\"'!gespeeld\")))","v":9},{"$f":"IF(B57=\"\",\"-\",INDIRECT(CONCATENATE(\"'\",B57,\"'!gewonnen\")))","v":5},{"$f":"IF(B57=\"\",\"-\",INDIRECT(CONCATENATE(\"'\",B57,\"'!gelijk\")))","v":0},{"$f":"IF(B57=\"\",\"-\",INDIRECT(CONCATENATE(\"'\",B57,\"'!verloren\")))","v":4},{"$f":"IF(B57=\"\",\"-\",INDIRECT(CONCATENATE(\"'\",B57,\"'!perc_gewonnen\")))","v":0.55555555555555558},{"$f":"IF(B57=\"\",\"-\",INDIRECT(CONCATENATE(\"'\",B57,\"'!perc_gelijk\")))","v":0},{"$f":"IF(B57=\"\",\"-\",INDIRECT(CONCATENATE(\"'\",B57,\"'!perc_verloren\")))","v":0.44444444444444442},{"$f":"IF(B57=\"\",\"-\",INDIRECT(CONCATENATE(\"'\",B57,\"'!wedstrijdpunten\")))","v":15},{"$f":"IF(B57=\"\",\"-\",INDIRECT(CONCATENATE(\"'\",B57,\"'!saldopunten\")))","v":28},{"$f":"IF(B57=\"\",\"-\",INDIRECT(CONCATENATE(\"'\",B57,\"'!saldopunten_per_wedstrijd\")))","v":3.1111111111111112}]
[null,"Frans Baert","'s-Hertogenbosch Zuid",9,6,1,2,0.66666666666666663,0.1111111111111111,0.22222222222222221,20,36,4]
[null,"Fred Eskens","De Schutskamp",3,0,1,2,0,0.33333333333333331,0.66666666666666663,2,-9,-3]
[null,"Geert Hollander","'s-Hertogenbosch Zuid",8,4,1,3,0.5,0.125,0.375,14,11,1.375]
[null,"Gerard van der Loo","De Schutskamp",12,10,1,1,0.83333333333333337,8.3333333333333329E-2,8.3333333333333329E-2,32,83,6.916666666666667]
[null,"Gert Hagemans","Hondsberg (Rosmalen)",6,2,0,4,0.33333333333333331,0,0.66666666666666663,6,-9,-1.5]
[null,"Hans Fleuren",{"$f":"IF(B63=\"\",\"-\",IF(INDIRECT(CONCATENATE(\"'\",B63,\"'!wijk_van_inschrijving\"))=\"\",\"-\",INDIRECT(CONCATENATE(\"'\",B63,\"'!wijk_van_inschrijving\"))))","v":"Hondsberg (Rosmalen)"},{"$f":"IF(B63=\"\",\"-\",INDIRECT(CONCATENATE(\"'\",B63,\"'!gespeeld\")))","v":3},{"$f":"IF(B63=\"\",\"-\",INDIRECT(CONCATENATE(\"'\",B63,\"'!gewonnen\")))","v":1},{"$f":"IF(B63=\"\",\"-\",INDIRECT(CONCATENATE(\"'\",B63,\"'!gelijk\")))","v":0},{"$f":"IF(B63=\"\",\"-\",INDIRECT(CONCATENATE(\"'\",B63,\"'!verloren\")))","v":2},{"$f":"IF(B63=\"\",\"-\",INDIRECT(CONCATENATE(\"'\",B63,\"'!perc_gewonnen\")))","v":0.33333333333333331},{"$f":"IF(B63=\"\",\"-\",INDIRECT(CONCATENATE(\"'\",B63,\"'!perc_gelijk\")))","v":0},{"$f":"IF(B63=\"\",\"-\",INDIRECT(CONCATENATE(\"'\",B63,\"'!perc_verloren\")))","v":0.66666666666666663},{"$f":"IF(B63=\"\",\"-\",INDIRECT(CONCATENATE(\"'\",B63,\"'!wedstrijdpunten\")))","v":3},{"$f":"IF(B63=\"\",\"-\",INDIRECT(CONCATENATE(\"'\",B63,\"'!saldopunten\")))","v":-14},{"$f":"IF(B63=\"\",\"-\",INDIRECT(CONCATENATE(\"'\",B63,\"'!saldopunten_per_wedstrijd\")))","v":-4.666666666666667}]
[null,"Hans van Woerkum","De Schutskamp",12,9,1,2,0.75,8.3333333333333329E-2,0.16666666666666666,29,68,5.666666666666667]
[null,"Harm Schilders","De Schutskamp",5,4,0,1,0.8,0,0.2,12,22,4.4000000000000004]
[null,"Henk Hermes","'s-Hertogenbosch Zuid",12,11,0,1,0.91666666666666663,0,8.3333333333333329E-2,33,70,5.833333333333333]
[null,"Henk Kuijs","'s-Hertogenbosch Zuid",3,2,0,1,0.66666666666666663,0,0.33333333333333331,6,4,1.3333333333333333]
[null,"Ilse van Mil","Hondsberg (Rosmalen)",7,3,0,4,0.42857142857142855,0,0.5714285714285714,9,0,0]
[null,"Ineke Poort","'s-Hertogenbosch Zuid",6,5,0,1,0.83333333333333337,0,0.16666666666666666,15,41,6.833333333333333]
[null,"Iris Vriend","'s-Hertogenbosch Zuid",10,0,0,10,0,0,1,0,-64,-6.4]
[null,"Jaap Faber","'s-Hertogenbosch Zuid",12,2,1,9,0.16666666666666666,8.3333333333333329E-2,0.75,8,-80,-6.666666666666667]
[null,"Jacques Tulkens","'s-Hertogenbosch Zuid",3,0,1,2,0,0.33333333333333331,0.66666666666666663,2,-15,-5]
[null,"Jan Rovers","De Hambaken",9,3,0,6,0.33333333333333331,0,0.66666666666666663,9,-11,-1.2222222222222223]
[null,"Jan van Alebeek","'s-Hertogenbosch Zuid",9,6,1,2,0.66666666666666663,0.1111111111111111,0.22222222222222221,20,28,3.1111111111111112]
[null,"Jan van den Akker","De Schutskamp",10,5,0,5,0.5,0,0.5,15,6,0.6]
[null,"Jan van den Broek","Hondsberg (Rosmalen)",7,4,1,2,0.5714285714285714,0.14285714285714285,0.2857142857142857,14,11,1.5714285714285714]
[null,"Jan Wijnhoven","De Schutskamp",9,3,0,6,0.33333333333333331,0,0.66666666666666663,9,-34,-3.7777777777777777]
[null,"Jilali Hasnaoui","De Schutskamp",4,1,0,3,0.25,0,0.75,3,-6,-1.5]
[null,"John den Houter","Hondsberg (Rosmalen)",8,3,0,5,0.375,0,0.625,9,-10,-1.25]
[null,"John Kuijpers","De Schutskamp",12,9,0,3,0.75,0,0.25,27,41,3.4166666666666665]
[null,"Jonne Schophuizen","De Schutskamp",9,3,2,4,0.33333333333333331,0.22222222222222221,0.44444444444444442,13,1,0.1111111111111111]
[null,"Jos de Kort","De Schutskamp",3,2,0,1,0.66666666666666663,0,0.33333333333333331,6,5,1.6666666666666667]
[null,"José van den Broek","Hondsberg (Rosmalen)",7,2,2,3,0.2857142857142857,0.2857142857142857,0.42857142857142855,10,-13,-1.8571428571428572]
[null,"Jürgen Cools","De Schutskamp",3,3,0,0,1,0,0,9,25,8.3333333333333339]
[null,"Lenie van Triest - Guijt","Hondsberg (Rosmalen)",7,3,0,4,0.42857142857142855,0,0.5714285714285714,9,-22,-3.1428571428571428]
[null,"Leo Leenders","De Schutskamp",3,3,0,0,1,0,0,9,19,6.333333333333333]
[null,"Lia Jansen","Hondsberg (Rosmalen)",7,3,0,4,0.42857142857142855,0,0.5714285714285714,9,1,0.14285714285714285]
[null,"Loek Zweekhorst","Hondsberg (Rosmalen)",5,3,0,2,0.6,0,0.4,9,2,0.4]
[null,"Maik van Zutphen","De Schutskamp",3,0,0,3,0,0,1,0,-12,-4]
[null,"Mari van Kessel",{"$f":"IF(B90=\"\",\"-\",IF(INDIRECT(CONCATENATE(\"'\",B90,\"'!wijk_van_inschrijving\"))=\"\",\"-\",INDIRECT(CONCATENATE(\"'\",B90,\"'!wijk_van_inschrijving\"))))","v":"'s-Hertogenbosch Zuid"},{"$f":"IF(B90=\"\",\"-\",INDIRECT(CONCATENATE(\"'\",B90,\"'!gespeeld\")))","v":12},{"$f":"IF(B90=\"\",\"-\",INDIRECT(CONCATENATE(\"'\",B90,\"'!gewonnen\")))","v":4},{"$f":"IF(B90=\"\",\"-\",INDIRECT(CONCATENATE(\"'\",B90,\"'!gelijk\")))","v":1},{"$f":"IF(B90=\"\",\"-\",INDIRECT(CONCATENATE(\"'\",B90,\"'!verloren\")))","v":7},{"$f":"IF(B90=\"\",\"-\",INDIRECT(CONCATENATE(\"'\",B90,\"'!perc_gewonnen\")))","v":0.33333333333333331},{"$f":"IF(B90=\"\",\"-\",INDIRECT(CONCATENATE(\"'\",B90,\"'!perc_gelijk\")))","v":8.3333333333333329E-2},{"$f":"IF(B90=\"\",\"-\",INDIRECT(CONCATENATE(\"'\",B90,\"'!perc_verloren\")))","v":0.58333333333333337},{"$f":"IF(B90=\"\",\"-\",INDIRECT(CONCATENATE(\"'\",B90,\"'!wedstrijdpunten\")))","v":14},{"$f":"IF(B90=\"\",\"-\",INDIRECT(CONCATENATE(\"'\",B90,\"'!saldopunten\")))","v":6},{"$f":"IF(B90=\"\",\"-\",INDIRECT(CONCATENATE(\"'\",B90,\"'!saldopunten_per_wedstrijd\")))","v":0.5}]
[null,"Maria de Zwart","Hondsberg (Rosmalen)",10,6,0,4,0.6,0,0.4,18,17,1.7]
[null,"Maria Grove","De Schutskamp",6,1,0,5,0.16666666666666666,0,0.83333333333333337,3,-22,-3.6666666666666665]
[null,"Marleen Kampert","De Hambaken",9,5,0,4,0.55555555555555558,0,0.44444444444444442,15,25,2.7777777777777777]
[null,"Martha Clement","De Schutskamp",3,1,0,2,0.33333333333333331,0,0.66666666666666663,3,-18,-6]
[null,"Maurice Maas","De Schutskamp",3,0,0,3,0,0,1,0,-9,-3]
[null,"Mecheline Heijmans","Hondsberg (Rosmalen)",7,4,1,2,0.5714285714285714,0.14285714285714285,0.2857142857142857,14,6,0.8571428571428571]
[null,"Mels van der Doelen","Hondsberg (Rosmalen)",2,0,0,2,0,0,1,0,-13,-6.5]
[null,"Mieke Lakwijk","De Schutskamp",9,3,1,5,0.33333333333333331,0.1111111111111111,0.55555555555555558,11,-41,-4.5555555555555554]
[null,"Mien van Tilburg","De Schutskamp",12,4,1,7,0.33333333333333331,8.3333333333333329E-2,0.58333333333333337,14,-31,-2.5833333333333335]
[null,"Mohammed Nazih","De Schutskamp",6,3,0,3,0.5,0,0.5,9,-6,-1]
[null,"Mohammed Serraji","De Schutskamp",12,6,1,5,0.5,8.3333333333333329E-2,0.41666666666666669,20,0,0]
[null,"Monique van Steeden","'s-Hertogenbosch Zuid",9,4,1,4,0.44444444444444442,0.1111111111111111,0.44444444444444442,14,3,0.33333333333333331]
[null,"Mustafa El Amouri","De Schutskamp",3,1,0,2,0.33333333333333331,0,0.66666666666666663,3,-11,-3.6666666666666665]
[null,"Mustapha Soussi","De Schutskamp",3,2,0,1,0.66666666666666663,0,0.33333333333333331,6,6,2]
[null,"Paul van den Merkhof","'s-Hertogenbosch Zuid",9,5,0,4,0.55555555555555558,0,0.44444444444444442,15,16,1.7777777777777777]
[null,"Peggy Roelofsen","De Schutskamp",3,2,0,1,0.66666666666666663,0,0.33333333333333331,6,5,1.6666666666666667]
[null,"Pepijn de Leeuwen","Hondsberg (Rosmalen)",2,1,0,1,0.5,0,0.5,3,-5,-2.5]
[null,"Peter Ondersteijn","'s-Hertogenbosch Zuid",9,5,1,3,0.55555555555555558,0.1111111111111111,0.33333333333333331,17,4,0.44444444444444442]
[null,"Petra Schepers","'s-Hertogenbosch Zuid",3,1,1,1,0.33333333333333331,0.33333333333333331,0.33333333333333331,5,8,2.6666666666666665]
[null,"Phil Roothans","De Hambaken",2,1,0,1,0.5,0,0.5,3,-4,-2]
[null,"Pierre Kisters","Hondsberg (Rosmalen)",11,5,1,5,0.45454545454545453,9.0909090909090912E-2,0.45454545454545453,17,-2,-0.18181818181818182]
[null,"Raymond Nijsten","De Schutskamp",9,3,0,6,0.33333333333333331,0,0.66666666666666663,9,-27,-3]
[null,"Ria de Kort","Hondsberg (Rosmalen)",10,5,1,4,0.5,0.1,0.4,17,-7,-0.7]
[null,"Riet Geerts","Hondsberg (Rosmalen)",10,3,1,6,0.3,0.1,0.6,11,-26,-2.6]
[null,"Rikie van der Laar","De Hambaken",3,1,0,2,0.33333333333333331,0,0.66666666666666663,3,-5,-1.6666666666666667]
[null,"Rikkie van der Wielen","De Schutskamp",1,1,0,0,1,0,0,3,4,4]
[null,"Ronald Schoo","'s-Hertogenbosch Zuid",12,6,0,6,0.5,0,0.5,18,13,1.0833333333333333]
[null,"Roy van de Brink","'s-Hertogenbosch Zuid",12,6,1,5,0.5,8.3333333333333329E-2,0.41666666666666669,20,0,0]
[null,"Ruud van Hintum","De Hambaken",{"$f":"IF(B119=\"\",\"-\",INDIRECT(CONCATENATE(\"'\",B119,\"'!gespeeld\")))","v":3},{"$f":"IF(B119=\"\",\"-\",INDIRECT(CONCATENATE(\"'\",B119,\"'!gewonnen\")))","v":3},{"$f":"IF(B119=\"\",\"-\",INDIRECT(CONCATENATE(\"'\",B119,\"'!gelijk\")))","v":0},{"$f":"IF(B119=\"\",\"-\",INDIRECT(CONCATENATE(\"'\",B119,\"'!verloren\")))","v":0},{"$f":"IF(B119=\"\",\"-\",INDIRECT(CONCATENATE(\"'\",B119,\"'!perc_gewonnen\")))","v":1},{"$f":"IF(B119=\"\",\"-\",INDIRECT(CONCATENATE(\"'\",B119,\"'!perc_gelijk\")))","v":0},{"$f":"IF(B119=\"\",\"-\",INDIRECT(CONCATENATE(\"'\",B119,\"'!perc_verloren\")))","v":0},{"$f":"IF(B119=\"\",\"-\",INDIRECT(CONCATENATE(\"'\",B119,\"'!wedstrijdpunten\")))","v":9},{"$f":"IF(B119=\"\",\"-\",INDIRECT(CONCATENATE(\"'\",B119,\"'!saldopunten\")))","v":13},{"$f":"IF(B119=\"\",\"-\",INDIRECT(CONCATENATE(\"'\",B119,\"'!saldopunten_per_wedstrijd\")))","v":4.333333333333333}]
[null,"Sjan Ondersteijn","'s-Hertogenbosch Zuid",12,7,1,4,0.58333333333333337,8.3333333333333329E-2,0.33333333333333331,23,26,2.1666666666666665]
[null,"Sylvester …","De Schutskamp",3,2,0,1,0.66666666666666663,0,0.33333333333333331,6,-6,-2]
[null,"Tara van der Heijden","De Schutskamp",3,1,0,2,0.33333333333333331,0,0.66666666666666663,3,-9,-3]
[null,"Theo Craane",{"$f":"IF(B123=\"\",\"-\",IF(INDIRECT(CONCATENATE(\"'\",B123,\"'!wijk_van_inschrijving\"))=\"\",\"-\",INDIRECT(CONCATENATE(\"'\",B123,\"'!wijk_van_inschrijving\"))))","v":"Hondsberg (Rosmalen)"},{"$f":"IF(B123=\"\",\"-\",INDIRECT(CONCATENATE(\"'\",B123,\"'!gespeeld\")))","v":10},{"$f":"IF(B123=\"\",\"-\",INDIRECT(CONCATENATE(\"'\",B123,\"'!gewonnen\")))","v":3},{"$f":"IF(B123=\"\",\"-\",INDIRECT(CONCATENATE(\"'\",B123,\"'!gelijk\")))","v":1},{"$f":"IF(B123=\"\",\"-\",INDIRECT(CONCATENATE(\"'\",B123,\"'!verloren\")))","v":6},{"$f":"IF(B123=\"\",\"-\",INDIRECT(CONCATENATE(\"'\",B123,\"'!perc_gewonnen\")))","v":0.3},{"$f":"IF(B123=\"\",\"-\",INDIRECT(CONCATENATE(\"'\",B123,\"'!perc_gelijk\")))","v":0.1},{"$f":"IF(B123=\"\",\"-\",INDIRECT(CONCATENATE(\"'\",B123,\"'!perc_verloren\")))","v":0.6},{"$f":"IF(B123=\"\",\"-\",INDIRECT(CONCATENATE(\"'\",B123,\"'!wedstrijdpunten\")))","v":11},{"$f":"IF(B123=\"\",\"-\",INDIRECT(CONCATENATE(\"'\",B123,\"'!saldopunten\")))","v":-1},{"$f":"IF(B123=\"\",\"-\",INDIRECT(CONCATENATE(\"'\",B123,\"'!saldopunten_per_wedstrijd\")))","v":-0.1}]
[null,"Tijs Verbruggen","'s-Hertogenbosch Zuid",6,1,0,5,0.16666666666666666,0,0.83333333333333337,3,-44,-7.333333333333333]
[null,"Tiny Heijmans","Hondsberg (Rosmalen)",5,3,1,1,0.6,0.2,0.2,11,30,6]
[null,"Tiny Smits","De Hambaken",6,3,0,3,0.5,0,0.5,9,-15,-2.5]
[null,"Ton van der Wel","De Schutskamp",3,2,0,1,0.66666666666666663,0,0.33333333333333331,6,15,5]
[null,"Ton van Huijstee","De Hambaken",3,0,0,3,0,0,1,0,-7,-2.3333333333333335]
[null,"Vera Beunk - Veeken","De Hambaken",9,7,0,2,0.77777777777777779,0,0.22222222222222221,21,25,2.7777777777777777]
[null,"Willem Hartman","De Schutskamp",5,4,1,0,0.8,0.2,0,14,17,3.4]
[null,"Willem Warnaar","De Schutskamp",9,3,0,6,0.33333333333333331,0,0.66666666666666663,9,-13,-1.4444444444444444]
[null,"Willy van der Wielen","De Hambaken",6,1,0,5,0.16666666666666666,0,0.83333333333333337,3,-37,-6.166666666666667]
[]
[]
[null,"Mocht jouw naam verkeerd geschreven staan, stuur dan even een e-mail naar:"]
[null,"info@puboisleduc.nl"]

{"sheet":"Ad Schellekens","index":1,"n_rows":56,"n_cols":9,"rows_kept":56,"cut":false,"hidden":false,"merged":[[18,7,20,8],[30,3,30,5],[12,1,12,8],[15,1,15,4],[16,1,16,4],[17,1,17,4],[18,1,18,4],[19,1,19,4],[20,1,20,4],[21,1,21,4],[22,1,22,4],[23,1,23,4],[24,1,24,4],[21,7,21,8],[27,1,27,8]]}
[]
[]
[]
[]
[]
[]
[]
[]
[]
[]
[]
[]
[null,"Ad Schellekens"]
[]
[]
[null,"Gespeeld",null,null,null,{"$f":"COUNTIF(G32:G57,\"W\")+COUNTIF(G32:G57,\"G\")+COUNTIF(G32:G57,\"V\")","v":6}]
[null,"Gewonnen",null,null,null,{"$f":"COUNTIF(G32:G57,\"W\")","v":3}]
[null,"Gelijk",null,null,null,{"$f":"COUNTIF(G32:G57,\"G\")","v":0}]
[null,"Verloren",null,null,null,{"$f":"COUNTIF(G32:G57,\"V\")","v":3},null,"Wijk van initiële inschrijving\n(met shirtkleur finaledag)"]
[null,"% gewonnen",null,null,null,{"$f":"IF(F16=0,0,F17/F16)","v":0.5}]
[null,"% gelijk",null,null,null,{"$f":"IF(F16=0,0,F18/F16)","v":0}]
[null,"% verloren",null,null,null,{"$f":"IF(F16=0,0,F19/F16)","v":0.5},null,"De Hambaken"]
[null,"Wedstrijdpunten",null,null,null,{"$f":"SUM(H32:H57)","v":9}]
[null,"Saldopunten",null,null,null,{"$f":"SUM(I32:I57)","v":-6}]
[null,"Saldopunten per wedstrijd",null,null,null,{"$f":"IF(F16=0,0,F24/F16)","v":-1}]
[]
[]
[null,"LET OP: alleen wedstrijden die daadwerkelijk gespeeld zijn in de wijk waarvoor jij je hebt ingeschreven tellen mee!"]
[]
[]
[null,"Datum","Locatie","UITSLAGEN",null,null,"W, V of G?","Wedstrijd-punten","Saldo-punten"]
[null,"2021-06-16","De Hambaken",9,"-",4,{"$f":"IF(OR($B$13=\"\",wijk_van_inschrijving=\"\"),\"-\",IF(OR(wijk_van_inschrijving<>C32,D32=\"\",F32=\"\"),\"-\",IF(D32>F32,\"W\",IF(D32=F32,\"G\",IF(D32<F32,\"V\",\"-\")))))","v":"W"},{"$f":"IF(OR($B$13=\"\",wijk_van_inschrijving=\"\"),\"-\",IF(OR(wijk_van_inschrijving<>C32,G32=\"-\",G32=\"\"),\"-\",IF(G32=\"W\",3,IF(G32=\"G\",2,IF(G32=\"V\",0,0)))))","v":3},{"$f":"IF(OR($B$13=\"\",wijk_van_inschrijving=\"\"),\"-\",IF(wijk_van_inschrijving<>C32,\"-\",IF(D32>=0,IF(F32=\"\",\"-\",D32-F32))))","v":5}]
[null,"2021-06-16","De Hambaken",7,"-",6,"W",3,1]
[null,"2021-06-16","De Hambaken",7,"-",6,"W",3,1]
[null,"2021-06-23","De Hambaken",8,"-",13,"V",0,-5]
[null,"2021-06-23","De Hambaken",4,"-",9,"V",0,-5]
[null,"2021-06-23","De Hambaken",10,"-",13,"V",0,-3]
[null,null,null,null,"-",null,"-","-","-"]
[null,null,null,null,"-",null,"-","-","-"]
[null,null,null,null,"-",null,"-","-","-"]
[null,null,null,null,"-",null,"-","-","-"]
[null,null,null,null,"-",null,"-","-","-"]
[null,null,null,null,"-",null,"-","-","-"]
[null,null,null,null,"-",null,"-","-","-"]
[null,null,null,null,"-",null,"-","-","-"]
[null,null,null,null,"-",null,"-","-","-"]
[null,null,null,null,"-",null,"-","-","-"]
[null,null,null,null,"-",null,"-","-","-"]
[null,null,null,null,"-",null,"-","-","-"]
[null,null,null,null,"-",null,"-","-","-"]
[null,null,null,null,"-",null,"-","-","-"]
[null,null,null,null,"-",null,"-","-","-"]
[null,null,null,null,"-",null,"-","-","-"]
[null,null,null,null,"-",null,"-","-","-"]
[null,null,null,null,"-",null,"-","-","-"]
[null,null,null,null,"-",null,"-","-","-"]

{"sheet":"André Abdoella","index":2,"n_rows":56,"n_cols":9,"rows_kept":56,"cut":false,"hidden":false,"merged":[[18,7,20,8],[30,3,30,5],[12,1,12,8],[15,1,15,4],[16,1,16,4],[17,1,17,4],[18,1,18,4],[19,1,19,4],[20,1,20,4],[21,1,21,4],[22,1,22,4],[23,1,23,4],[24,1,24,4],[21,7,21,8],[27,1,27,8]]}
[]
[]
[]
[]
[]
[]
[]
[]
[]
[]
[]
[]
[null,"André Abdoella"]
[]
[]
[null,"Gespeeld",null,null,null,{"$f":"COUNTIF(G32:G57,\"W\")+COUNTIF(G32:G57,\"G\")+COUNTIF(G32:G57,\"V\")","v":12}]
[null,"Gewonnen",null,null,null,{"$f":"COUNTIF(G32:G57,\"W\")","v":10}]
[null,"Gelijk",null,null,null,{"$f":"COUNTIF(G32:G57,\"G\")","v":0}]
[null,"Verloren",null,null,null,{"$f":"COUNTIF(G32:G57,\"V\")","v":2},null,"Wijk van initiële inschrijving\n(met shirtkleur finaledag)"]
[null,"% gewonnen",null,null,null,{"$f":"IF(F16=0,0,F17/F16)","v":0.83333333333333337}]
[null,"% gelijk",null,null,null,{"$f":"IF(F16=0,0,F18/F16)","v":0}]
[null,"% verloren",null,null,null,{"$f":"IF(F16=0,0,F19/F16)","v":0.16666666666666666},null,"'s-Hertogenbosch Zuid"]
[null,"Wedstrijdpunten",null,null,null,{"$f":"SUM(H32:H57)","v":30}]
[null,"Saldopunten",null,null,null,{"$f":"SUM(I32:I57)","v":56}]
[null,"Saldopunten per wedstrijd",null,null,null,{"$f":"IF(F16=0,0,F24/F16)","v":4.666666666666667}]
[]
[]
[null,"LET OP: alleen wedstrijden die daadwerkelijk gespeeld zijn in de wijk waarvoor jij je hebt ingeschreven tellen mee!"]
[]
[]
[null,"Datum","Locatie","UITSLAGEN",null,null,"W, V of G?","Wedstrijd-punten","Saldo-punten"]
[null,"2021-06-18","'s-Hertogenbosch Zuid",4,"-",13,{"$f":"IF(OR($B$13=\"\",wijk_van_inschrijving=\"\"),\"-\",IF(OR(wijk_van_inschrijving<>C32,D32=\"\",F32=\"\"),\"-\",IF(D32>F32,\"W\",IF(D32=F32,\"G\",IF(D32<F32,\"V\",\"-\")))))","v":"V"},{"$f":"IF(OR($B$13=\"\",wijk_van_inschrijving=\"\"),\"-\",IF(OR(wijk_van_inschrijving<>C32,G32=\"-\",G32=\"\"),\"-\",IF(G32=\"W\",3,IF(G32=\"G\",2,IF(G32=\"V\",0,0)))))","v":0},{"$f":"IF(OR($B$13=\"\",wijk_van_inschrijving=\"\"),\"-\",IF(wijk_van_inschrijving<>C32,\"-\",IF(D32>=0,IF(F32=\"\",\"-\",D32-F32))))","v":-9}]
[null,"2021-06-18","'s-Hertogenbosch Zuid",7,"-",5,"W",3,2]
[null,"2021-06-18","'s-Hertogenbosch Zuid",13,"-",1,"W",3,12]
[null,"2021-06-25","'s-Hertogenbosch Zuid",13,"-",9,"W",3,4]
[null,"2021-06-25","'s-Hertogenbosch Zuid",13,"-",0,"W",3,13]
[null,"2021-06-25","'s-Hertogenbosch Zuid",13,"-",9,"W",3,4]
[null,"2021-07-01","'s-Hertogenbosch Zuid",12,"-",7,"W",3,5]
[null,"2021-07-01","'s-Hertogenbosch Zuid",4,"-",13,"V",0,-9]
[null,"2021-07-01","'s-Hertogenbosch Zuid",13,"-",0,"W",3,13]
[null,"2021-07-08","'s-Hertogenbosch Zuid",13,"-",3,"W",3,10]
[null,"2021-07-08","'s-Hertogenbosch Zuid",10,"-",3,"W",3,7]
[null,"2021-07-08","'s-Hertogenbosch Zuid",12,"-",8,"W",3,4]
[null,null,null,null,"-",null,"-","-","-"]
[null,null,null,null,"-",null,"-","-","-"]
[null,null,null,null,"-",null,"-","-","-"]
[null,null,null,null,"-",null,"-","-","-"]
[null,null,null,null,"-",null,"-","-","-"]
[null,null,null,null,"-",null,"-","-","-"]
[null,null,null,null,"-",null,"-","-","-"]
[null,null,null,null,"-",null,"-","-","-"]
[null,null,null,null,"-",null,"-","-","-"]
[null,null,null,null,"-",null,"-","-","-"]
[null,null,null,null,"-",null,"-","-","-"]
[null,null,null,null,"-",null,"-","-","-"]
[null,null,null,null,"-",null,"-","-","-"]

{"sheet":"Annie Liebrand","index":3,"n_rows":56,"n_cols":9,"rows_kept":56,"cut":false,"hidden":false,"merged":[[18,7,20,8],[30,3,30,5],[12,1,12,8],[15,1,15,4],[16,1,16,4],[17,1,17,4],[18,1,18,4],[19,1,19,4],[20,1,20,4],[21,1,21,4],[22,1,22,4],[23,1,23,4],[24,1,24,4],[21,7,21,8],[27,1,27,8]]}
[]
[]
[]
[]
[]
[]
[]
[]
[]
[]
[]
[]
[null,"Annie Liebrand"]
[]
[]
[null,"Gespeeld",null,null,null,{"$f":"COUNTIF(G32:G57,\"W\")+COUNTIF(G32:G57,\"G\")+COUNTIF(G32:G57,\"V\")","v":12}]
[null,"Gewonnen",null,null,null,{"$f":"COUNTIF(G32:G57,\"W\")","v":5}]
[null,"Gelijk",null,null,null,{"$f":"COUNTIF(G32:G57,\"G\")","v":0}]
[null,"Verloren",null,null,null,{"$f":"COUNTIF(G32:G57,\"V\")","v":7},null,"Wijk van initiële inschrijving\n(met shirtkleur finaledag)"]
[null,"% gewonnen",null,null,null,{"$f":"IF(F16=0,0,F17/F16)","v":0.41666666666666669}]
[null,"% gelijk",null,null,null,{"$f":"IF(F16=0,0,F18/F16)","v":0}]
[null,"% verloren",null,null,null,{"$f":"IF(F16=0,0,F19/F16)","v":0.58333333333333337},null,"'s-Hertogenbosch Zuid"]
[null,"Wedstrijdpunten",null,null,null,{"$f":"SUM(H32:H57)","v":15}]
[null,"Saldopunten",null,null,null,{"$f":"SUM(I32:I57)","v":-30}]
[null,"Saldopunten per wedstrijd",null,null,null,{"$f":"IF(F16=0,0,F24/F16)","v":-2.5}]
[]
[]
[null,"LET OP: alleen wedstrijden die daadwerkelijk gespeeld zijn in de wijk waarvoor jij je hebt ingeschreven tellen mee!"]
[]
[]
[null,"Datum","Locatie","UITSLAGEN",null,null,"W, V of G?","Wedstrijd-punten","Saldo-punten"]
[null,"2021-06-18","'s-Hertogenbosch Zuid",13,"-",4,{"$f":"IF(OR($B$13=\"\",wijk_van_inschrijving=\"\"),\"-\",IF(OR(wijk_van_inschrijving<>C32,D32=\"\",F32=\"\"),\"-\",IF(D32>F32,\"W\",IF(D32=F32,\"G\",IF(D32<F32,\"V\",\"-\")))))","v":"W"},{"$f":"IF(OR($B$13=\"\",wijk_van_inschrijving=\"\"),\"-\",IF(OR(wijk_van_inschrijving<>C32,G32=\"-\",G32=\"\"),\"-\",IF(G32=\"W\",3,IF(G32=\"G\",2,IF(G32=\"V\",0,0)))))","v":3},{"$f":"IF(OR($B$13=\"\",wijk_van_inschrijving=\"\"),\"-\",IF(wijk_van_inschrijving<>C32,\"-\",IF(D32>=0,IF(F32=\"\",\"-\",D32-F32))))","v":9}]
[null,"2021-06-18","'s-Hertogenbosch Zuid",1,"-",12,"V",0,-11]
[null,"2021-06-18","'s-Hertogenbosch Zuid",2,"-",13,"V",0,-11]
[null,"2021-06-25","'s-Hertogenbosch Zuid",13,"-",4,"W",3,9]
[null,"2021-06-25","'s-Hertogenbosch Zuid",0,"-",13,"V",0,-13]
[null,"2021-06-25","'s-Hertogenbosch Zuid",3,"-",13,"V",0,-10]
[null,"2021-07-01","'s-Hertogenbosch Zuid",5,"-",13,"V",0,-8]
[null,"2021-07-01","'s-Hertogenbosch Zuid",8,"-",6,"W",3,2]
[null,"2021-07-01","'s-Hertogenbosch Zuid",13,"-",8,"W",3,5]
[null,"2021-07-08","'s-Hertogenbosch Zuid",10,"-",2,"W",3,8]
[null,"2021-07-08","'s-Hertogenbosch Zuid",5,"-",11,"V",0,-6]
[null,"2021-07-08","'s-Hertogenbosch Zuid",8,"-",12,"V",0,-4]
[null,null,null,null,"-",null,"-","-","-"]
[null,null,null,null,"-",null,"-","-","-"]
[null,null,null,null,"-",null,"-","-","-"]
[null,null,null,null,"-",null,"-","-","-"]
[null,null,null,null,"-",null,"-","-","-"]
[null,null,null,null,"-",null,"-","-","-"]
[null,null,null,null,"-",null,"-","-","-"]
[null,null,null,null,"-",null,"-","-","-"]
[null,null,null,null,"-",null,"-","-","-"]
[null,null,null,null,"-",null,"-","-","-"]
[null,null,null,null,"-",null,"-","-","-"]
[null,null,null,null,"-",null,"-","-","-"]
[null,null,null,null,"-",null,"-","-","-"]

{"sheet":"Anne-Louise Westelaken","index":4,"n_rows":56,"n_cols":9,"rows_kept":56,"cut":false,"hidden":false,"merged":[[18,7,20,8],[30,3,30,5],[12,1,12,8],[15,1,15,4],[16,1,16,4],[17,1,17,4],[18,1,18,4],[19,1,19,4],[20,1,20,4],[21,1,21,4],[22,1,22,4],[23,1,23,4],[24,1,24,4],[21,7,21,8],[27,1,27,8]]}
[]
[]
[]
[]
[]
[]
[]
[]
[]
[]
[]
[]
[null,"Anne-Louise Westelaken"]
[]
[]
[null,"Gespeeld",null,null,null,{"$f":"COUNTIF(G32:G57,\"W\")+COUNTIF(G32:G57,\"G\")+COUNTIF(G32:G57,\"V\")","v":3}]
[null,"Gewonnen",null,null,null,{"$f":"COUNTIF(G32:G57,\"W\")","v":1}]
[null,"Gelijk",null,null,null,{"$f":"COUNTIF(G32:G57,\"G\")","v":0}]
[null,"Verloren",null,null,null,{"$f":"COUNTIF(G32:G57,\"V\")","v":2},null,"Wijk van initiële inschrijving\n(met shirtkleur finaledag)"]
[null,"% gewonnen",null,null,null,{"$f":"IF(F16=0,0,F17/F16)","v":0.33333333333333331}]
[null,"% gelijk",null,null,null,{"$f":"IF(F16=0,0,F18/F16)","v":0}]
[null,"% verloren",null,null,null,{"$f":"IF(F16=0,0,F19/F16)","v":0.66666666666666663},null,"Hondsberg (Rosmalen)"]
[null,"Wedstrijdpunten",null,null,null,{"$f":"SUM(H32:H57)","v":3}]
[null,"Saldopunten",null,null,null,{"$f":"SUM(I32:I57)","v":-6}]
[null,"Saldopunten per wedstrijd",null,null,null,{"$f":"IF(F16=0,0,F24/F16)","v":-2}]
[]
[]
[null,"LET OP: alleen wedstrijden die daadwerkelijk gespeeld zijn in de wijk waarvoor jij je hebt ingeschreven tellen mee!"]
[]
[]
[null,"Datum","Locatie","UITSLAGEN",null,null,"W, V of G?","Wedstrijd-punten","Saldo-punten"]
[null,"2021-06-15","Hondsberg (Rosmalen)",7,"-",9,{"$f":"IF(OR($B$13=\"\",wijk_van_inschrijving=\"\"),\"-\",IF(OR(wijk_van_inschrijving<>C32,D32=\"\",F32=\"\"),\"-\",IF(D32>F32,\"W\",IF(D32=F32,\"G\",IF(D32<F32,\"V\",\"-\")))))","v":"V"},{"$f":"IF(OR($B$13=\"\",wijk_van_inschrijving=\"\"),\"-\",IF(OR(wijk_van_inschrijving<>C32,G32=\"-\",G32=\"\"),\"-\",IF(G32=\"W\",3,IF(G32=\"G\",2,IF(G32=\"V\",0,0)))))","v":0},{"$f":"IF(OR($B$13=\"\",wijk_van_inschrijving=\"\"),\"-\",IF(wijk_van_inschrijving<>C32,\"-\",IF(D32>=0,IF(F32=\"\",\"-\",D32-F32))))","v":-2}]
[null,"2021-06-15","Hondsberg (Rosmalen)",8,"-",5,"W",3,3]
[null,"2021-06-15","Hondsberg (Rosmalen)",6,"-",13,"V",0,-7]
[null,null,null,null,"-",null,"-","-","-"]
[null,null,null,null,"-",null,"-","-","-"]
[null,null,null,null,"-",null,"-","-","-"]
[null,null,null,null,"-",null,"-","-","-"]
[null,null,null,null,"-",null,"-","-","-"]
[null,null,null,null,"-",null,"-","-","-"]
[null,null,null,null,"-",null,"-","-","-"]
[null,null,null,null,"-",null,"-","-","-"]
[null,null,null,null,"-",null,"-","-","-"]
[null,null,null,null,"-",null,"-","-","-"]
[null,null,null,null,"-",null,"-","-","-"]
[null,null,null,null,"-",null,"-","-","-"]
[null,null,null,null,"-",null,"-","-","-"]
[null,null,null,null,"-",null,"-","-","-"]
[null,null,null,null,"-",null,"-","-","-"]
[null,null,null,null,"-",null,"-","-","-"]
[null,null,null,null,"-",null,"-","-","-"]
[null,null,null,null,"-",null,"-","-","-"]
[null,null,null,null,"-",null,"-","-","-"]
[null,null,null,null,"-",null,"-","-","-"]
[null,null,null,null,"-",null,"-","-","-"]
[null,null,null,null,"-",null,"-","-","-"]

{"sheet":"Antoinette Brok","index":5,"n_rows":56,"n_cols":9,"rows_kept":56,"cut":false,"hidden":false,"merged":[[18,7,20,8],[30,3,30,5],[12,1,12,8],[15,1,15,4],[16,1,16,4],[17,1,17,4],[18,1,18,4],[19,1,19,4],[20,1,20,4],[21,1,21,4],[22,1,22,4],[23,1,23,4],[24,1,24,4],[21,7,21,8],[27,1,27,8]]}
[]
[]
[]
[]
[]
[]
[]
[]
[]
[]
[]
[]
[null,"Antoinette Brok"]
[]
[]
[null,"Gespeeld",null,null,null,{"$f":"COUNTIF(G32:G57,\"W\")+COUNTIF(G32:G57,\"G\")+COUNTIF(G32:G57,\"V\")","v":5}]
[null,"Gewonnen",null,null,null,{"$f":"COUNTIF(G32:G57,\"W\")","v":4}]
[null,"Gelijk",null,null,null,{"$f":"COUNTIF(G32:G57,\"G\")","v":1}]
[null,"Verloren",null,null,null,{"$f":"COUNTIF(G32:G57,\"V\")","v":0},null,"Wijk van initiële inschrijving\n(met shirtkleur finaledag)"]
[null,"% gewonnen",null,null,null,{"$f":"IF(F16=0,0,F17/F16)","v":0.8}]
[null,"% gelijk",null,null,null,{"$f":"IF(F16=0,0,F18/F16)","v":0.2}]
[null,"% verloren",null,null,null,{"$f":"IF(F16=0,0,F19/F16)","v":0},null,"De Schutskamp"]
[null,"Wedstrijdpunten",null,null,null,{"$f":"SUM(H32:H57)","v":14}]
[null,"Saldopunten",null,null,null,{"$f":"SUM(I32:I57)","v":30}]
[null,"Saldopunten per wedstrijd",null,null,null,{"$f":"IF(F16=0,0,F24/F16)","v":6}]
[]
[]
[null,"LET OP: alleen wedstrijden die daadwerkelijk gespeeld zijn in de wijk waarvoor jij je hebt ingeschreven tellen mee!"]
[]
[]
[null,"Datum","Locatie","UITSLAGEN",null,null,"W, V of G?","Wedstrijd-punten","Saldo-punten"]
[null,"2021-06-14","De Schutskamp",8,"-",1,{"$f":"IF(OR($B$13=\"\",wijk_van_inschrijving=\"\"),\"-\",IF(OR(wijk_van_inschrijving<>C32,D32=\"\",F32=\"\"),\"-\",IF(D32>F32,\"W\",IF(D32=F32,\"G\",IF(D32<F32,\"V\",\"-\")))))","v":"W"},{"$f":"IF(OR($B$13=\"\",wijk_van_inschrijving=\"\"),\"-\",IF(OR(wijk_van_inschrijving<>C32,G32=\"-\",G32=\"\"),\"-\",IF(G32=\"W\",3,IF(G32=\"G\",2,IF(G32=\"V\",0,0)))))","v":3},{"$f":"IF(OR($B$13=\"\",wijk_van_inschrijving=\"\"),\"-\",IF(wijk_van_inschrijving<>C32,\"-\",IF(D32>=0,IF(F32=\"\",\"-\",D32-F32))))","v":7}]
[null,"2021-06-14","De Schutskamp",13,"-",4,"W",3,9]
[null,"2021-06-24","De Schutskamp",13,"-",3,"W",3,10]
[null,"2021-06-24","De Schutskamp",10,"-",6,"W",3,4]
[null,"2021-06-24","De Schutskamp",11,"-",11,"G",2,0]
[null,null,null,null,"-",null,"-","-","-"]
[null,null,null,null,"-",null,"-","-","-"]
[null,null,null,null,"-",null,"-","-","-"]
[null,null,null,null,"-",null,"-","-","-"]
[null,null,null,null,"-",null,"-","-","-"]
[null,null,null,null,"-",null,"-","-","-"]
[null,null,null,null,"-",null,"-","-","-"]
[null,null,null,null,"-",null,"-","-","-"]
[null,null,null,null,"-",null,"-","-","-"]
[null,null,null,null,"-",null,"-","-","-"]
[null,null,null,null,"-",null,"-","-","-"]
[null,null,null,null,"-",null,"-","-","-"]
[null,null,null,null,"-",null,"-","-","-"]
[null,null,null,null,"-",null,"-","-","-"]
[null,null,null,null,"-",null,"-","-","-"]
[null,null,null,null,"-",null,"-","-","-"]
[null,null,null,null,"-",null,"-","-","-"]
[null,null,null,null,"-",null,"-","-","-"]
[null,null,null,null,"-",null,"-","-","-"]
[null,null,null,null,"-",null,"-","-","-"]

{"sheet":"Antoon van Mil","index":6,"n_rows":56,"n_cols":9,"rows_kept":56,"cut":false,"hidden":false,"merged":[[19,1,19,4],[12,1,12,8],[15,1,15,4],[16,1,16,4],[17,1,17,4],[18,1,18,4],[18,7,20,8],[27,1,27,8],[30,3,30,5],[20,1,20,4],[21,7,21,8],[21,1,21,4],[22,1,22,4],[23,1,23,4],[24,1,24,4]]}
[]
[]
[]
[]
[]
[]
[]
[]
[]
[]
[]
[]
[null,"Antoon van Mil"]
[]
[]
[null,"Gespeeld",null,null,null,{"$f":"COUNTIF(G32:G57,\"W\")+COUNTIF(G32:G57,\"G\")+COUNTIF(G32:G57,\"V\")","v":5}]
[null,"Gewonnen",null,null,null,{"$f":"COUNTIF(G32:G57,\"W\")","v":2}]
[null,"Gelijk",null,null,null,{"$f":"COUNTIF(G32:G57,\"G\")","v":0}]
[null,"Verloren",null,null,null,{"$f":"COUNTIF(G32:G57,\"V\")","v":3},null,"Wijk van initiële inschrijving\n(met shirtkleur finaledag)"]
[null,"% gewonnen",null,null,null,{"$f":"IF(F16=0,0,F17/F16)","v":0.4}]
[null,"% gelijk",null,null,null,{"$f":"IF(F16=0,0,F18/F16)","v":0}]
[null,"% verloren",null,null,null,{"$f":"IF(F16=0,0,F19/F16)","v":0.6},null,"'s-Hertogenbosch Zuid"]
[null,"Wedstrijdpunten",null,null,null,{"$f":"SUM(H32:H57)","v":6}]
[null,"Saldopunten",null,null,null,{"$f":"SUM(I32:I57)","v":7}]
[null,"Saldopunten per wedstrijd",null,null,null,{"$f":"IF(F16=0,0,F24/F16)","v":1.4}]
[]
[]
[null,"LET OP: alleen wedstrijden die daadwerkelijk gespeeld zijn in de wijk waarvoor jij je hebt ingeschreven tellen mee!"]
[]
[]
[null,"Datum","Locatie","UITSLAGEN",null,null,"W, V of G?","Wedstrijd-punten","Saldo-punten"]
[null,"2021-07-01","'s-Hertogenbosch Zuid",11,"-",3,{"$f":"IF(OR($B$13=\"\",wijk_van_inschrijving=\"\"),\"-\",IF(OR(wijk_van_inschrijving<>C32,D32=\"\",F32=\"\"),\"-\",IF(D32>F32,\"W\",IF(D32=F32,\"G\",IF(D32<F32,\"V\",\"-\")))))","v":"W"},{"$f":"IF(OR($B$13=\"\",wijk_van_inschrijving=\"\"),\"-\",IF(OR(wijk_van_inschrijving<>C32,G32=\"-\",G32=\"\"),\"-\",IF(G32=\"W\",3,IF(G32=\"G\",2,IF(G32=\"V\",0,0)))))","v":3},{"$f":"IF(OR($B$13=\"\",wijk_van_inschrijving=\"\"),\"-\",IF(wijk_van_inschrijving<>C32,\"-\",IF(D32>=0,IF(F32=\"\",\"-\",D32-F32))))","v":8}]
[null,"2021-07-01","'s-Hertogenbosch Zuid",13,"-",1,"W",3,12]
[null,"2021-07-08","'s-Hertogenbosch Zuid",2,"-",10,"V",0,-8]
[null,"2021-07-08","'s-Hertogenbosch Zuid",7,"-",8,"V",0,-1]
[null,"2021-07-08","'s-Hertogenbosch Zuid",8,"-",12,"V",0,-4]
[null,null,null,null,"-",null,"-","-","-"]
[null,null,null,null,"-",null,"-","-","-"]
[null,null,null,null,"-",null,"-","-","-"]
[null,null,null,null,"-",null,"-","-","-"]
[null,null,null,null,"-",null,"-","-","-"]
[null,null,null,null,"-",null,"-","-","-"]
[null,null,null,null,"-",null,"-","-","-"]
[null,null,null,null,"-",null,"-","-","-"]
[null,null,null,null,"-",null,"-","-","-"]
[null,null,null,null,"-",null,"-","-","-"]
[null,null,null,null,"-",null,"-","-","-"]
[null,null,null,null,"-",null,"-","-","-"]
[null,null,null,null,"-",null,"-","-","-"]
[null,null,null,null,"-",null,"-","-","-"]
[null,null,null,null,"-",null,"-","-","-"]
[null,null,null,null,"-",null,"-","-","-"]
[null,null,null,null,"-",null,"-","-","-"]
[null,null,null,null,"-",null,"-","-","-"]
[null,null,null,null,"-",null,"-","-","-"]
[null,null,null,null,"-",null,"-","-","-"]

{"sheet":"Bart Blatter","index":7,"n_rows":56,"n_cols":9,"rows_kept":56,"cut":false,"hidden":false,"merged":[[12,1,12,8],[15,1,15,4],[16,1,16,4],[17,1,17,4],[18,1,18,4],[18,7,20,8],[19,1,19,4],[20,1,20,4],[30,3,30,5],[21,1,21,4],[21,7,21,8],[22,1,22,4],[23,1,23,4],[24,1,24,4],[27,1,27,8]]}
[]
[]
[]
[]
[]
[]
[]
[]
[]
[]
[]
[]
[null,"Bart Blatter"]
[]
[]
[null,"Gespeeld",null,null,null,{"$f":"COUNTIF(G32:G57,\"W\")+COUNTIF(G32:G57,\"G\")+COUNTIF(G32:G57,\"V\")","v":3}]
[null,"Gewonnen",null,null,null,{"$f":"COUNTIF(G32:G57,\"W\")","v":1}]
[null,"Gelijk",null,null,null,{"$f":"COUNTIF(G32:G57,\"G\")","v":0}]
[null,"Verloren",null,null,null,{"$f":"COUNTIF(G32:G57,\"V\")","v":2},null,"Wijk van initiële inschrijving\n(met shirtkleur finaledag)"]
[null,"% gewonnen",null,null,null,{"$f":"IF(F16=0,0,F17/F16)","v":0.33333333333333331}]
[null,"% gelijk",null,null,null,{"$f":"IF(F16=0,0,F18/F16)","v":0}]
[null,"% verloren",null,null,null,{"$f":"IF(F16=0,0,F19/F16)","v":0.66666666666666663},null,"De Schutskamp"]
[null,"Wedstrijdpunten",null,null,null,{"$f":"SUM(H32:H57)","v":3}]
[null,"Saldopunten",null,null,null,{"$f":"SUM(I32:I57)","v":-10}]
[null,"Saldopunten per wedstrijd",null,null,null,{"$f":"IF(F16=0,0,F24/F16)","v":-3.3333333333333335}]
[]
[]
[null,"LET OP: alleen wedstrijden die daadwerkelijk gespeeld zijn in de wijk waarvoor jij je hebt ingeschreven tellen mee!"]
[]
[]
[null,"Datum","Locatie","UITSLAGEN",null,null,"W, V of G?","Wedstrijd-punten","Saldo-punten"]
[null,"2021-07-05","De Schutskamp",6,"-",10,{"$f":"IF(OR($B$13=\"\",wijk_van_inschrijving=\"\"),\"-\",IF(OR(wijk_van_inschrijving<>C32,D32=\"\",F32=\"\"),\"-\",IF(D32>F32,\"W\",IF(D32=F32,\"G\",IF(D32<F32,\"V\",\"-\")))))","v":"V"},{"$f":"IF(OR($B$13=\"\",wijk_van_inschrijving=\"\"),\"-\",IF(OR(wijk_van_inschrijving<>C32,G32=\"-\",G32=\"\"),\"-\",IF(G32=\"W\",3,IF(G32=\"G\",2,IF(G32=\"V\",0,0)))))","v":0},{"$f":"IF(OR($B$13=\"\",wijk_van_inschrijving=\"\"),\"-\",IF(wijk_van_inschrijving<>C32,\"-\",IF(D32>=0,IF(F32=\"\",\"-\",D32-F32))))","v":-4}]
[null,"2021-07-05","De Schutskamp",12,"-",8,"W",3,4]
[null,"2021-07-05","De Schutskamp",3,"-",13,"V",0,-10]
[null,null,null,null,"-",null,"-","-","-"]
[null,null,null,null,"-",null,"-","-","-"]
[null,null,null,null,"-",null,"-","-","-"]
[null,null,null,null,"-",null,"-","-","-"]
[null,null,null,null,"-",null,"-","-","-"]
[null,null,null,null,"-",null,"-","-","-"]
[null,null,null,null,"-",null,"-","-","-"]
[null,null,null,null,"-",null,"-","-","-"]
[null,null,null,null,"-",null,"-","-","-"]
[null,null,null,null,"-",null,"-","-","-"]
[null,null,null,null,"-",null,"-","-","-"]
[null,null,null,null,"-",null,"-","-","-"]
[null,null,null,null,"-",null,"-","-","-"]
[null,null,null,null,"-",null,"-","-","-"]
[null,null,null,null,"-",null,"-","-","-"]
[null,null,null,null,"-",null,"-","-","-"]
[null,null,null,null,"-",null,"-","-","-"]
[null,null,null,null,"-",null,"-","-","-"]
[null,null,null,null,"-",null,"-","-","-"]
[null,null,null,null,"-",null,"-","-","-"]
[null,null,null,null,"-",null,"-","-","-"]
[null,null,null,null,"-",null,"-","-","-"]

{"sheet":"Bas Peters","index":8,"n_rows":56,"n_cols":9,"rows_kept":56,"cut":false,"hidden":false,"merged":[[12,1,12,8],[15,1,15,4],[16,1,16,4],[17,1,17,4],[18,1,18,4],[18,7,20,8],[19,1,19,4],[20,1,20,4],[30,3,30,5],[21,1,21,4],[21,7,21,8],[22,1,22,4],[23,1,23,4],[24,1,24,4],[27,1,27,8]]}
[]
[]
[]
[]
[]
[]
[]
[]
[]
[]
[]
[]
[null,"Bas Peters"]
[]
[]
[null,"Gespeeld",null,null,null,{"$f":"COUNTIF(G32:G57,\"W\")+COUNTIF(G32:G57,\"G\")+COUNTIF(G32:G57,\"V\")","v":2}]
[null,"Gewonnen",null,null,null,{"$f":"COUNTIF(G32:G57,\"W\")","v":1}]
[null,"Gelijk",null,null,null,{"$f":"COUNTIF(G32:G57,\"G\")","v":0}]
[null,"Verloren",null,null,null,{"$f":"COUNTIF(G32:G57,\"V\")","v":1},null,"Wijk van initiële inschrijving\n(met shirtkleur finaledag)"]
[null,"% gewonnen",null,null,null,{"$f":"IF(F16=0,0,F17/F16)","v":0.5}]
[null,"% gelijk",null,null,null,{"$f":"IF(F16=0,0,F18/F16)","v":0}]
[null,"% verloren",null,null,null,{"$f":"IF(F16=0,0,F19/F16)","v":0.5},null,"De Schutskamp"]
[null,"Wedstrijdpunten",null,null,null,{"$f":"SUM(H32:H57)","v":3}]
[null,"Saldopunten",null,null,null,{"$f":"SUM(I32:I57)","v":0}]
[null,"Saldopunten per wedstrijd",null,null,null,{"$f":"IF(F16=0,0,F24/F16)","v":0}]
[]
[]
[null,"LET OP: alleen wedstrijden die daadwerkelijk gespeeld zijn in de wijk waarvoor jij je hebt ingeschreven tellen mee!"]
[]
[]
[null,"Datum","Locatie","UITSLAGEN",null,null,"W, V of G?","Wedstrijd-punten","Saldo-punten"]
[null,"2021-07-05","De Schutskamp",13,"-",9,{"$f":"IF(OR($B$13=\"\",wijk_van_inschrijving=\"\"),\"-\",IF(OR(wijk_van_inschrijving<>C32,D32=\"\",F32=\"\"),\"-\",IF(D32>F32,\"W\",IF(D32=F32,\"G\",IF(D32<F32,\"V\",\"-\")))))","v":"W"},{"$f":"IF(OR($B$13=\"\",wijk_van_inschrijving=\"\"),\"-\",IF(OR(wijk_van_inschrijving<>C32,G32=\"-\",G32=\"\"),\"-\",IF(G32=\"W\",3,IF(G32=\"G\",2,IF(G32=\"V\",0,0)))))","v":3},{"$f":"IF(OR($B$13=\"\",wijk_van_inschrijving=\"\"),\"-\",IF(wijk_van_inschrijving<>C32,\"-\",IF(D32>=0,IF(F32=\"\",\"-\",D32-F32))))","v":4}]
[null,"2021-07-05","De Schutskamp",8,"-",12,"V",0,-4]
[null,null,null,null,"-",null,"-","-","-"]
[null,null,null,null,"-",null,"-","-","-"]
[null,null,null,null,"-",null,"-","-","-"]
[null,null,null,null,"-",null,"-","-","-"]
[null,null,null,null,"-",null,"-","-","-"]
[null,null,null,null,"-",null,"-","-","-"]
[null,null,null,null,"-",null,"-","-","-"]
[null,null,null,null,"-",null,"-","-","-"]
[null,null,null,null,"-",null,"-","-","-"]
[null,null,null,null,"-",null,"-","-","-"]
[null,null,null,null,"-",null,"-","-","-"]
[null,null,null,null,"-",null,"-","-","-"]
[null,null,null,null,"-",null,"-","-","-"]
[null,null,null,null,"-",null,"-","-","-"]
[null,null,null,null,"-",null,"-","-","-"]
[null,null,null,null,"-",null,"-","-","-"]
[null,null,null,null,"-",null,"-","-","-"]
[null,null,null,null,"-",null,"-","-","-"]
[null,null,null,null,"-",null,"-","-","-"]
[null,null,null,null,"-",null,"-","-","-"]
[null,null,null,null,"-",null,"-","-","-"]
[null,null,null,null,"-",null,"-","-","-"]
[null,null,null,null,"-",null,"-","-","-"]

{"sheet":"Ben Kok","index":9,"n_rows":56,"n_cols":9,"rows_kept":56,"cut":false,"hidden":false,"merged":[[18,7,20,8],[30,3,30,5],[12,1,12,8],[15,1,15,4],[16,1,16,4],[17,1,17,4],[18,1,18,4],[19,1,19,4],[20,1,20,4],[21,1,21,4],[22,1,22,4],[23,1,23,4],[24,1,24,4],[21,7,21,8],[27,1,27,8]]}
[]
[]
[]
[]
[]
[]
[]
[]
[]
[]
[]
[]
[null,"Ben Kok"]
[]
[]
[null,"Gespeeld",null,null,null,{"$f":"COUNTIF(G32:G57,\"W\")+COUNTIF(G32:G57,\"G\")+COUNTIF(G32:G57,\"V\")","v":9}]
[null,"Gewonnen",null,null,null,{"$f":"COUNTIF(G32:G57,\"W\")","v":3}]
[null,"Gelijk",null,null,null,{"$f":"COUNTIF(G32:G57,\"G\")","v":2}]
[null,"Verloren",null,null,null,{"$f":"COUNTIF(G32:G57,\"V\")","v":4},null,"Wijk van initiële inschrijving\n(met shirtkleur finaledag)"]
[null,"% gewonnen",null,null,null,{"$f":"IF(F16=0,0,F17/F16)","v":0.33333333333333331}]
[null,"% gelijk",null,null,null,{"$f":"IF(F16=0,0,F18/F16)","v":0.22222222222222221}]
[null,"% verloren",null,null,null,{"$f":"IF(F16=0,0,F19/F16)","v":0.44444444444444442},null,"De Schutskamp"]
[null,"Wedstrijdpunten",null,null,null,{"$f":"SUM(H32:H57)","v":13}]
[null,"Saldopunten",null,null,null,{"$f":"SUM(I32:I57)","v":-11}]
[null,"Saldopunten per wedstrijd",null,null,null,{"$f":"IF(F16=0,0,F24/F16)","v":-1.2222222222222223}]
[]
[]
[null,"LET OP: alleen wedstrijden die daadwerkelijk gespeeld zijn in de wijk waarvoor jij je hebt ingeschreven tellen mee!"]
[]
[]
[null,"Datum","Locatie","UITSLAGEN",null,null,"W, V of G?","Wedstrijd-punten","Saldo-punten"]
[null,"2021-06-14","De Schutskamp",0,"-",13,{"$f":"IF(OR($B$13=\"\",wijk_van_inschrijving=\"\"),\"-\",IF(OR(wijk_van_inschrijving<>C32,D32=\"\",F32=\"\"),\"-\",IF(D32>F32,\"W\",IF(D32=F32,\"G\",IF(D32<F32,\"V\",\"-\")))))","v":"V"},{"$f":"IF(OR($B$13=\"\",wijk_van_inschrijving=\"\"),\"-\",IF(OR(wijk_van_inschrijving<>C32,G32=\"-\",G32=\"\"),\"-\",IF(G32=\"W\",3,IF(G32=\"G\",2,IF(G32=\"V\",0,0)))))","v":0},{"$f":"IF(OR($B$13=\"\",wijk_van_inschrijving=\"\"),\"-\",IF(wijk_van_inschrijving<>C32,\"-\",IF(D32>=0,IF(F32=\"\",\"-\",D32-F32))))","v":-13}]
[null,"2021-06-14","De Schutskamp",7,"-",4,"W",3,3]
[null,"2021-06-14","De Schutskamp",5,"-",9,"V",0,-4]
[null,"2021-06-24","De Schutskamp",5,"-",5,"G",2,0]
[null,"2021-06-24","De Schutskamp",3,"-",13,"V",0,-10]
[null,"2021-06-24","De Schutskamp",12,"-",13,"V",0,-1]
[null,"2021-06-28","De Schutskamp",13,"-",8,"W",3,5]
[null,"2021-06-28","De Schutskamp",13,"-",4,"W",3,9]
[null,"2021-06-28","De Schutskamp",9,"-",9,"G",2,0]
[null,null,null,null,"-",null,"-","-","-"]
[null,null,null,null,"-",null,"-","-","-"]
[null,null,null,null,"-",null,"-","-","-"]
[null,null,null,null,"-",null,"-","-","-"]
[null,null,null,null,"-",null,"-","-","-"]
[null,null,null,null,"-",null,"-","-","-"]
[null,null,null,null,"-",null,"-","-","-"]
[null,null,null,null,"-",null,"-","-","-"]
[null,null,null,null,"-",null,"-","-","-"]
[null,null,null,null,"-",null,"-","-","-"]
[null,null,null,null,"-",null,"-","-","-"]
[null,null,null,null,"-",null,"-","-","-"]
[null,null,null,null,"-",null,"-","-","-"]
[null,null,null,null,"-",null,"-","-","-"]
[null,null,null,null,"-",null,"-","-","-"]
[null,null,null,null,"-",null,"-","-","-"]

{"sheet":"Bep Bosters","index":10,"n_rows":56,"n_cols":9,"rows_kept":56,"cut":false,"hidden":false,"merged":[[12,1,12,8],[15,1,15,4],[16,1,16,4],[17,1,17,4],[18,1,18,4],[18,7,20,8],[19,1,19,4],[20,1,20,4],[30,3,30,5],[21,1,21,4],[21,7,21,8],[22,1,22,4],[23,1,23,4],[24,1,24,4],[27,1,27,8]]}
[]
[]
[]
[]
[]
[]
[]
[]
[]
[]
[]
[]
[null,"Bep Bosters"]
[]
[]
[null,"Gespeeld",null,null,null,{"$f":"COUNTIF(G32:G57,\"W\")+COUNTIF(G32:G57,\"G\")+COUNTIF(G32:G57,\"V\")","v":3}]
[null,"Gewonnen",null,null,null,{"$f":"COUNTIF(G32:G57,\"W\")","v":2}]
[null,"Gelijk",null,null,null,{"$f":"COUNTIF(G32:G57,\"G\")","v":0}]
[null,"Verloren",null,null,null,{"$f":"COUNTIF(G32:G57,\"V\")","v":1},null,"Wijk van initiële inschrijving\n(met shirtkleur finaledag)"]
[null,"% gewonnen",null,null,null,{"$f":"IF(F16=0,0,F17/F16)","v":0.66666666666666663}]
[null,"% gelijk",null,null,null,{"$f":"IF(F16=0,0,F18/F16)","v":0}]
[null,"% verloren",null,null,null,{"$f":"IF(F16=0,0,F19/F16)","v":0.33333333333333331},null,"De Schutskamp"]
[null,"Wedstrijdpunten",null,null,null,{"$f":"SUM(H32:H57)","v":6}]
[null,"Saldopunten",null,null,null,{"$f":"SUM(I32:I57)","v":10}]
[null,"Saldopunten per wedstrijd",null,null,null,{"$f":"IF(F16=0,0,F24/F16)","v":3.3333333333333335}]
[]
[]
[null,"LET OP: alleen wedstrijden die daadwerkelijk gespeeld zijn in de wijk waarvoor jij je hebt ingeschreven tellen mee!"]
[]
[]
[null,"Datum","Locatie","UITSLAGEN",null,null,"W, V of G?","Wedstrijd-punten","Saldo-punten"]
[null,"2021-07-05","De Schutskamp",6,"-",8,{"$f":"IF(OR($B$13=\"\",wijk_van_inschrijving=\"\"),\"-\",IF(OR(wijk_van_inschrijving<>C32,D32=\"\",F32=\"\"),\"-\",IF(D32>F32,\"W\",IF(D32=F32,\"G\",IF(D32<F32,\"V\",\"-\")))))","v":"V"},{"$f":"IF(OR($B$13=\"\",wijk_van_inschrijving=\"\"),\"-\",IF(OR(wijk_van_inschrijving<>C32,G32=\"-\",G32=\"\"),\"-\",IF(G32=\"W\",3,IF(G32=\"G\",2,IF(G32=\"V\",0,0)))))","v":0},{"$f":"IF(OR($B$13=\"\",wijk_van_inschrijving=\"\"),\"-\",IF(wijk_van_inschrijving<>C32,\"-\",IF(D32>=0,IF(F32=\"\",\"-\",D32-F32))))","v":-2}]
[null,"2021-07-05","De Schutskamp",9,"-",3,"W",3,6]
[null,"2021-07-05","De Schutskamp",9,"-",3,"W",3,6]
[null,null,null,null,"-",null,"-","-","-"]
[null,null,null,null,"-",null,"-","-","-"]
[null,null,null,null,"-",null,"-","-","-"]
[null,null,null,null,"-",null,"-","-","-"]
[null,null,null,null,"-",null,"-","-","-"]
[null,null,null,null,"-",null,"-","-","-"]
[null,null,null,null,"-",null,"-","-","-"]
[null,null,null,null,"-",null,"-","-","-"]
[null,null,null,null,"-",null,"-","-","-"]
[null,null,null,null,"-",null,"-","-","-"]
[null,null,null,null,"-",null,"-","-","-"]
[null,null,null,null,"-",null,"-","-","-"]
[null,null,null,null,"-",null,"-","-","-"]
[null,null,null,null,"-",null,"-","-","-"]
[null,null,null,null,"-",null,"-","-","-"]
[null,null,null,null,"-",null,"-","-","-"]
[null,null,null,null,"-",null,"-","-","-"]
[null,null,null,null,"-",null,"-","-","-"]
[null,null,null,null,"-",null,"-","-","-"]
[null,null,null,null,"-",null,"-","-","-"]
[null,null,null,null,"-",null,"-","-","-"]
[null,null,null,null,"-",null,"-","-","-"]

{"sheet":"Bernard van der Wielen","index":11,"n_rows":56,"n_cols":9,"rows_kept":56,"cut":false,"hidden":false,"merged":[[18,7,20,8],[30,3,30,5],[12,1,12,8],[15,1,15,4],[16,1,16,4],[17,1,17,4],[18,1,18,4],[19,1,19,4],[20,1,20,4],[21,1,21,4],[22,1,22,4],[23,1,23,4],[24,1,24,4],[21,7,21,8],[27,1,27,8]]}
[]
[]
[]
[]
[]
[]
[]
[]
[]
[]
[]
[]
[null,"Bernard van der Wielen"]
[]
[]
[null,"Gespeeld",null,null,null,{"$f":"COUNTIF(G32:G57,\"W\")+COUNTIF(G32:G57,\"G\")+COUNTIF(G32:G57,\"V\")","v":1}]
[null,"Gewonnen",null,null,null,{"$f":"COUNTIF(G32:G57,\"W\")","v":1}]
[null,"Gelijk",null,null,null,{"$f":"COUNTIF(G32:G57,\"G\")","v":0}]
[null,"Verloren",null,null,null,{"$f":"COUNTIF(G32:G57,\"V\")","v":0},null,"Wijk van initiële inschrijving\n(met shirtkleur finaledag)"]
[null,"% gewonnen",null,null,null,{"$f":"IF(F16=0,0,F17/F16)","v":1}]
[null,"% gelijk",null,null,null,{"$f":"IF(F16=0,0,F18/F16)","v":0}]
[null,"% verloren",null,null,null,{"$f":"IF(F16=0,0,F19/F16)","v":0},null,"De Schutskamp"]
[null,"Wedstrijdpunten",null,null,null,{"$f":"SUM(H32:H57)","v":3}]
[null,"Saldopunten",null,null,null,{"$f":"SUM(I32:I57)","v":10}]
[null,"Saldopunten per wedstrijd",null,null,null,{"$f":"IF(F16=0,0,F24/F16)","v":10}]
[]
[]
[null,"LET OP: alleen wedstrijden die daadwerkelijk gespeeld zijn in de wijk waarvoor jij je hebt ingeschreven tellen mee!"]
[]
[]
[null,"Datum","Locatie","UITSLAGEN",null,null,"W, V of G?","Wedstrijd-punten","Saldo-punten"]
[null,"2021-06-14","De Schutskamp",13,"-",3,{"$f":"IF(OR($B$13=\"\",wijk_van_inschrijving=\"\"),\"-\",IF(OR(wijk_van_inschrijving<>C32,D32=\"\",F32=\"\"),\"-\",IF(D32>F32,\"W\",IF(D32=F32,\"G\",IF(D32<F32,\"V\",\"-\")))))","v":"W"},{"$f":"IF(OR($B$13=\"\",wijk_van_inschrijving=\"\"),\"-\",IF(OR(wijk_van_inschrijving<>C32,G32=\"-\",G32=\"\"),\"-\",IF(G32=\"W\",3,IF(G32=\"G\",2,IF(G32=\"V\",0,0)))))","v":3},{"$f":"IF(OR($B$13=\"\",wijk_van_inschrijving=\"\"),\"-\",IF(wijk_van_inschrijving<>C32,\"-\",IF(D32>=0,IF(F32=\"\",\"-\",D32-F32))))","v":10}]
[null,null,null,null,"-",null,"-","-","-"]
[null,null,null,null,"-",null,"-","-","-"]
[null,null,null,null,"-",null,"-","-","-"]
[null,null,null,null,"-",null,"-","-","-"]
[null,null,null,null,"-",null,"-","-","-"]
[null,null,null,null,"-",null,"-","-","-"]
[null,null,null,null,"-",null,"-","-","-"]
[null,null,null,null,"-",null,"-","-","-"]
[null,null,null,null,"-",null,"-","-","-"]
[null,null,null,null,"-",null,"-","-","-"]
[null,null,null,null,"-",null,"-","-","-"]
[null,null,null,null,"-",null,"-","-","-"]
[null,null,null,null,"-",null,"-","-","-"]
[null,null,null,null,"-",null,"-","-","-"]
[null,null,null,null,"-",null,"-","-","-"]
[null,null,null,null,"-",null,"-","-","-"]
[null,null,null,null,"-",null,"-","-","-"]
[null,null,null,null,"-",null,"-","-","-"]
[null,null,null,null,"-",null,"-","-","-"]
[null,null,null,null,"-",null,"-","-","-"]
[null,null,null,null,"-",null,"-","-","-"]
[null,null,null,null,"-",null,"-","-","-"]
[null,null,null,null,"-",null,"-","-","-"]
[null,null,null,null,"-",null,"-","-","-"]

{"sheet":"Casper Westelaken","index":12,"n_rows":56,"n_cols":9,"rows_kept":56,"cut":false,"hidden":false,"merged":[[18,7,20,8],[30,3,30,5],[12,1,12,8],[15,1,15,4],[16,1,16,4],[17,1,17,4],[18,1,18,4],[19,1,19,4],[20,1,20,4],[21,1,21,4],[22,1,22,4],[23,1,23,4],[24,1,24,4],[21,7,21,8],[27,1,27,8]]}
[]
[]
[]
[]
[]
[]
[]
[]
[]
[]
[]
[]
[null,"Casper Westelaken"]
[]
[]
[null,"Gespeeld",null,null,null,{"$f":"COUNTIF(G32:G57,\"W\")+COUNTIF(G32:G57,\"G\")+COUNTIF(G32:G57,\"V\")","v":3}]
[null,"Gewonnen",null,null,null,{"$f":"COUNTIF(G32:G57,\"W\")","v":0}]
[null,"Gelijk",null,null,null,{"$f":"COUNTIF(G32:G57,\"G\")","v":0}]
[null,"Verloren",null,null,null,{"$f":"COUNTIF(G32:G57,\"V\")","v":3},null,"Wijk van initiële inschrijving\n(met shirtkleur finaledag)"]
[null,"% gewonnen",null,null,null,{"$f":"IF(F16=0,0,F17/F16)","v":0}]
[null,"% gelijk",null,null,null,{"$f":"IF(F16=0,0,F18/F16)","v":0}]
[null,"% verloren",null,null,null,{"$f":"IF(F16=0,0,F19/F16)","v":1},null,"Hondsberg (Rosmalen)"]
[null,"Wedstrijdpunten",null,null,null,{"$f":"SUM(H32:H57)","v":0}]
[null,"Saldopunten",null,null,null,{"$f":"SUM(I32:I57)","v":-11}]
[null,"Saldopunten per wedstrijd",null,null,null,{"$f":"IF(F16=0,0,F24/F16)","v":-3.6666666666666665}]
[]
[]
[null,"LET OP: alleen wedstrijden die daadwerkelijk gespeeld zijn in de wijk waarvoor jij je hebt ingeschreven tellen mee!"]
[]
[]
[null,"Datum","Locatie","UITSLAGEN",null,null,"W, V of G?","Wedstrijd-punten","Saldo-punten"]
[null,"2021-06-15","Hondsberg (Rosmalen)",7,"-",9,{"$f":"IF(OR($B$13=\"\",wijk_van_inschrijving=\"\"),\"-\",IF(OR(wijk_van_inschrijving<>C32,D32=\"\",F32=\"\"),\"-\",IF(D32>F32,\"W\",IF(D32=F32,\"G\",IF(D32<F32,\"V\",\"-\")))))","v":"V"},{"$f":"IF(OR($B$13=\"\",wijk_van_inschrijving=\"\"),\"-\",IF(OR(wijk_van_inschrijving<>C32,G32=\"-\",G32=\"\"),\"-\",IF(G32=\"W\",3,IF(G32=\"G\",2,IF(G32=\"V\",0,0)))))","v":0},{"$f":"IF(OR($B$13=\"\",wijk_van_inschrijving=\"\"),\"-\",IF(wijk_van_inschrijving<>C32,\"-\",IF(D32>=0,IF(F32=\"\",\"-\",D32-F32))))","v":-2}]
[null,"2021-06-15","Hondsberg (Rosmalen)",6,"-",8,"V",0,-2]
[null,"2021-06-15","Hondsberg (Rosmalen)",6,"-",13,"V",0,-7]
[null,null,null,null,"-",null,"-","-","-"]
[null,null,null,null,"-",null,"-","-","-"]
[null,null,null,null,"-",null,"-","-","-"]
[null,null,null,null,"-",null,"-","-","-"]
[null,null,null,null,"-",null,"-","-","-"]
[null,null,null,null,"-",null,"-","-","-"]
[null,null,null,null,"-",null,"-","-","-"]
[null,null,null,null,"-",null,"-","-","-"]
[null,null,null,null,"-",null,"-","-","-"]
[null,null,null,null,"-",null,"-","-","-"]
[null,null,null,null,"-",null,"-","-","-"]
[null,null,null,null,"-",null,"-","-","-"]
[null,null,null,null,"-",null,"-","-","-"]
[null,null,null,null,"-",null,"-","-","-"]
[null,null,null,null,"-",null,"-","-","-"]
[null,null,null,null,"-",null,"-","-","-"]
[null,null,null,null,"-",null,"-","-","-"]
[null,null,null,null,"-",null,"-","-","-"]
[null,null,null,null,"-",null,"-","-","-"]
[null,null,null,null,"-",null,"-","-","-"]
[null,null,null,null,"-",null,"-","-","-"]
[null,null,null,null,"-",null,"-","-","-"]

{"sheet":"Chantal Stuiver","index":13,"n_rows":56,"n_cols":9,"rows_kept":56,"cut":false,"hidden":false,"merged":[[27,1,27,8],[30,3,30,5],[20,1,20,4],[21,7,21,8],[21,1,21,4],[22,1,22,4],[23,1,23,4],[24,1,24,4],[18,7,20,8],[19,1,19,4],[12,1,12,8],[15,1,15,4],[16,1,16,4],[17,1,17,4],[18,1,18,4]]}
[]
[]
[]
[]
[]
[]
[]
[]
[]
[]
[]
[]
[null,"Chantal Stuiver"]
[]
[]
[null,"Gespeeld",null,null,null,{"$f":"COUNTIF(G32:G57,\"W\")+COUNTIF(G32:G57,\"G\")+COUNTIF(G32:G57,\"V\")","v":2}]
[null,"Gewonnen",null,null,null,{"$f":"COUNTIF(G32:G57,\"W\")","v":1}]
[null,"Gelijk",null,null,null,{"$f":"COUNTIF(G32:G57,\"G\")","v":0}]
[null,"Verloren",null,null,null,{"$f":"COUNTIF(G32:G57,\"V\")","v":1},null,"Wijk van initiële inschrijving\n(met shirtkleur finaledag)"]
[null,"% gewonnen",null,null,null,{"$f":"IF(F16=0,0,F17/F16)","v":0.5}]
[null,"% gelijk",null,null,null,{"$f":"IF(F16=0,0,F18/F16)","v":0}]
[null,"% verloren",null,null,null,{"$f":"IF(F16=0,0,F19/F16)","v":0.5},null,"Hondsberg (Rosmalen)"]
[null,"Wedstrijdpunten",null,null,null,{"$f":"SUM(H32:H57)","v":3}]
[null,"Saldopunten",null,null,null,{"$f":"SUM(I32:I57)","v":1}]
[null,"Saldopunten per wedstrijd",null,null,null,{"$f":"IF(F16=0,0,F24/F16)","v":0.5}]
[]
[]
[null,"LET OP: alleen wedstrijden die daadwerkelijk gespeeld zijn in de wijk waarvoor jij je hebt ingeschreven tellen mee!"]
[]
[]
[null,"Datum","Locatie","UITSLAGEN",null,null,"W, V of G?","Wedstrijd-punten","Saldo-punten"]
[null,"2021-06-30","Hondsberg (Rosmalen)",3,"-",6,{"$f":"IF(OR($B$13=\"\",wijk_van_inschrijving=\"\"),\"-\",IF(OR(wijk_van_inschrijving<>C32,D32=\"\",F32=\"\"),\"-\",IF(D32>F32,\"W\",IF(D32=F32,\"G\",IF(D32<F32,\"V\",\"-\")))))","v":"V"},{"$f":"IF(OR($B$13=\"\",wijk_van_inschrijving=\"\"),\"-\",IF(OR(wijk_van_inschrijving<>C32,G32=\"-\",G32=\"\"),\"-\",IF(G32=\"W\",3,IF(G32=\"G\",2,IF(G32=\"V\",0,0)))))","v":0},{"$f":"IF(OR($B$13=\"\",wijk_van_inschrijving=\"\"),\"-\",IF(wijk_van_inschrijving<>C32,\"-\",IF(D32>=0,IF(F32=\"\",\"-\",D32-F32))))","v":-3}]
[null,"2021-06-30","Hondsberg (Rosmalen)",9,"-",5,"W",3,4]
[null,null,null,null,"-",null,"-","-","-"]
[null,null,null,null,"-",null,"-","-","-"]
[null,null,null,null,"-",null,"-","-","-"]
[null,null,null,null,"-",null,"-","-","-"]
[null,null,null,null,"-",null,"-","-","-"]
[null,null,null,null,"-",null,"-","-","-"]
[null,null,null,null,"-",null,"-","-","-"]
[null,null,null,null,"-",null,"-","-","-"]
[null,null,null,null,"-",null,"-","-","-"]
[null,null,null,null,"-",null,"-","-","-"]
[null,null,null,null,"-",null,"-","-","-"]
[null,null,null,null,"-",null,"-","-","-"]
[null,null,null,null,"-",null,"-","-","-"]
[null,null,null,null,"-",null,"-","-","-"]
[null,null,null,null,"-",null,"-","-","-"]
[null,null,null,null,"-",null,"-","-","-"]
[null,null,null,null,"-",null,"-","-","-"]
[null,null,null,null,"-",null,"-","-","-"]
[null,null,null,null,"-",null,"-","-","-"]
[null,null,null,null,"-",null,"-","-","-"]
[null,null,null,null,"-",null,"-","-","-"]
[null,null,null,null,"-",null,"-","-","-"]
[null,null,null,null,"-",null,"-","-","-"]

{"sheet":"Christ van Esch","index":14,"n_rows":56,"n_cols":9,"rows_kept":56,"cut":false,"hidden":false,"merged":[[18,7,20,8],[23,1,23,4],[24,1,24,4],[30,3,30,5],[12,1,12,8],[15,1,15,4],[16,1,16,4],[18,1,18,4],[19,1,19,4],[21,1,21,4],[17,1,17,4],[20,1,20,4],[22,1,22,4],[21,7,21,8],[27,1,27,8]]}
[]
[]
[]
[]
[]
[]
[]
[]
[]
[]
[]
[]
[null,"Christ van Esch"]
[]
[]
[null,"Gespeeld",null,null,null,{"$f":"COUNTIF(G32:G57,\"W\")+COUNTIF(G32:G57,\"G\")+COUNTIF(G32:G57,\"V\")","v":3}]
[null,"Gewonnen",null,null,null,{"$f":"COUNTIF(G32:G57,\"W\")","v":2}]
[null,"Gelijk",null,null,null,{"$f":"COUNTIF(G32:G57,\"G\")","v":0}]
[null,"Verloren",null,null,null,{"$f":"COUNTIF(G32:G57,\"V\")","v":1},null,"Wijk van initiële inschrijving\n(met shirtkleur finaledag)"]
[null,"% gewonnen",null,null,null,{"$f":"IF(F16=0,0,F17/F16)","v":0.66666666666666663}]
[null,"% gelijk",null,null,null,{"$f":"IF(F16=0,0,F18/F16)","v":0}]
[null,"% verloren",null,null,null,{"$f":"IF(F16=0,0,F19/F16)","v":0.33333333333333331},null,"'s-Hertogenbosch Zuid"]
[null,"Wedstrijdpunten",null,null,null,{"$f":"SUM(H32:H57)","v":6}]
[null,"Saldopunten",null,null,null,{"$f":"SUM(I32:I57)","v":11}]
[null,"Saldopunten per wedstrijd",null,null,null,{"$f":"IF(F16=0,0,F24/F16)","v":3.6666666666666665}]
[]
[]
[null,"LET OP: alleen wedstrijden die daadwerkelijk gespeeld zijn in de wijk waarvoor jij je hebt ingeschreven tellen mee!"]
[]
[]
[null,"Datum","Locatie","UITSLAGEN",null,null,"W, V of G?","Wedstrijd-punten","Saldo-punten"]
[null,"2021-06-18","'s-Hertogenbosch Zuid",13,"-",1,{"$f":"IF(OR($B$13=\"\",wijk_van_inschrijving=\"\"),\"-\",IF(OR(wijk_van_inschrijving<>C32,D32=\"\",F32=\"\"),\"-\",IF(D32>F32,\"W\",IF(D32=F32,\"G\",IF(D32<F32,\"V\",\"-\")))))","v":"W"},{"$f":"IF(OR($B$13=\"\",wijk_van_inschrijving=\"\"),\"-\",IF(OR(wijk_van_inschrijving<>C32,G32=\"-\",G32=\"\"),\"-\",IF(G32=\"W\",3,IF(G32=\"G\",2,IF(G32=\"V\",0,0)))))","v":3},{"$f":"IF(OR($B$13=\"\",wijk_van_inschrijving=\"\"),\"-\",IF(wijk_van_inschrijving<>C32,\"-\",IF(D32>=0,IF(F32=\"\",\"-\",D32-F32))))","v":12}]
[null,"2021-06-18","'s-Hertogenbosch Zuid",5,"-",7,"V",0,-2]
[null,"2021-06-18","'s-Hertogenbosch Zuid",11,"-",10,"W",3,1]
[null,null,null,null,"-",null,"-","-","-"]
[null,null,null,null,"-",null,"-","-","-"]
[null,null,null,null,"-",null,"-","-","-"]
[null,null,null,null,"-",null,"-","-","-"]
[null,null,null,null,"-",null,"-","-","-"]
[null,null,null,null,"-",null,"-","-","-"]
[null,null,null,null,"-",null,"-","-","-"]
[null,null,null,null,"-",null,"-","-","-"]
[null,null,null,null,"-",null,"-","-","-"]
[null,null,null,null,"-",null,"-","-","-"]
[null,null,null,null,"-",null,"-","-","-"]
[null,null,null,null,"-",null,"-","-","-"]
[null,null,null,null,"-",null,"-","-","-"]
[null,null,null,null,"-",null,"-","-","-"]
[null,null,null,null,"-",null,"-","-","-"]
[null,null,null,null,"-",null,"-","-","-"]
[null,null,null,null,"-",null,"-","-","-"]
[null,null,null,null,"-",null,"-","-","-"]
[null,null,null,null,"-",null,"-","-","-"]
[null,null,null,null,"-",null,"-","-","-"]
[null,null,null,null,"-",null,"-","-","-"]
[null,null,null,null,"-",null,"-","-","-"]

{"sheet":"Clara van Kessel","index":15,"n_rows":56,"n_cols":9,"rows_kept":56,"cut":false,"hidden":false,"merged":[[27,1,27,8],[30,3,30,5],[20,1,20,4],[21,7,21,8],[21,1,21,4],[22,1,22,4],[23,1,23,4],[24,1,24,4],[18,7,20,8],[19,1,19,4],[12,1,12,8],[15,1,15,4],[16,1,16,4],[17,1,17,4],[18,1,18,4]]}
[]
[]
[]
[]
[]
[]
[]
[]
[]
[]
[]
[]
[null,"Clara van Kessel"]
[]
[]
[null,"Gespeeld",null,null,null,{"$f":"COUNTIF(G32:G57,\"W\")+COUNTIF(G32:G57,\"G\")+COUNTIF(G32:G57,\"V\")","v":3}]
[null,"Gewonnen",null,null,null,{"$f":"COUNTIF(G32:G57,\"W\")","v":0}]
[null,"Gelijk",null,null,null,{"$f":"COUNTIF(G32:G57,\"G\")","v":0}]
[null,"Verloren",null,null,null,{"$f":"COUNTIF(G32:G57,\"V\")","v":3},null,"Wijk van initiële inschrijving\n(met shirtkleur finaledag)"]
[null,"% gewonnen",null,null,null,{"$f":"IF(F16=0,0,F17/F16)","v":0}]
[null,"% gelijk",null,null,null,{"$f":"IF(F16=0,0,F18/F16)","v":0}]
[null,"% verloren",null,null,null,{"$f":"IF(F16=0,0,F19/F16)","v":1},null,"'s-Hertogenbosch Zuid"]
[null,"Wedstrijdpunten",null,null,null,{"$f":"SUM(H32:H57)","v":0}]
[null,"Saldopunten",null,null,null,{"$f":"SUM(I32:I57)","v":-24}]
[null,"Saldopunten per wedstrijd",null,null,null,{"$f":"IF(F16=0,0,F24/F16)","v":-8}]
[]
[]
[null,"LET OP: alleen wedstrijden die daadwerkelijk gespeeld zijn in de wijk waarvoor jij je hebt ingeschreven tellen mee!"]
[]
[]
[null,"Datum","Locatie","UITSLAGEN",null,null,"W, V of G?","Wedstrijd-punten","Saldo-punten"]
[null,"2021-06-25","'s-Hertogenbosch Zuid",9,"-",13,{"$f":"IF(OR($B$13=\"\",wijk_van_inschrijving=\"\"),\"-\",IF(OR(wijk_van_inschrijving<>C32,D32=\"\",F32=\"\"),\"-\",IF(D32>F32,\"W\",IF(D32=F32,\"G\",IF(D32<F32,\"V\",\"-\")))))","v":"V"},{"$f":"IF(OR($B$13=\"\",wijk_van_inschrijving=\"\"),\"-\",IF(OR(wijk_van_inschrijving<>C32,G32=\"-\",G32=\"\"),\"-\",IF(G32=\"W\",3,IF(G32=\"G\",2,IF(G32=\"V\",0,0)))))","v":0},{"$f":"IF(OR($B$13=\"\",wijk_van_inschrijving=\"\"),\"-\",IF(wijk_van_inschrijving<>C32,\"-\",IF(D32>=0,IF(F32=\"\",\"-\",D32-F32))))","v":-4}]
[null,"2021-06-25","'s-Hertogenbosch Zuid",0,"-",13,"V",0,-13]
[null,"2021-06-25","'s-Hertogenbosch Zuid",5,"-",12,"V",0,-7]
[null,null,null,null,"-",null,"-","-","-"]
[null,null,null,null,"-",null,"-","-","-"]
[null,null,null,null,"-",null,"-","-","-"]
[null,null,null,null,"-",null,"-","-","-"]
[null,null,null,null,"-",null,"-","-","-"]
[null,null,null,null,"-",null,"-","-","-"]
[null,null,null,null,"-",null,"-","-","-"]
[null,null,null,null,"-",null,"-","-","-"]
[null,null,null,null,"-",null,"-","-","-"]
[null,null,null,null,"-",null,"-","-","-"]
[null,null,null,null,"-",null,"-","-","-"]
[null,null,null,null,"-",null,"-","-","-"]
[null,null,null,null,"-",null,"-","-","-"]
[null,null,null,null,"-",null,"-","-","-"]
[null,null,null,null,"-",null,"-","-","-"]
[null,null,null,null,"-",null,"-","-","-"]
[null,null,null,null,"-",null,"-","-","-"]
[null,null,null,null,"-",null,"-","-","-"]
[null,null,null,null,"-",null,"-","-","-"]
[null,null,null,null,"-",null,"-","-","-"]
[null,null,null,null,"-",null,"-","-","-"]
[null,null,null,null,"-",null,"-","-","-"]

{"sheet":"Clemens de Mol","index":16,"n_rows":56,"n_cols":9,"rows_kept":56,"cut":false,"hidden":false,"merged":[[18,7,20,8],[30,3,30,5],[12,1,12,8],[15,1,15,4],[16,1,16,4],[17,1,17,4],[18,1,18,4],[19,1,19,4],[20,1,20,4],[21,1,21,4],[22,1,22,4],[23,1,23,4],[24,1,24,4],[21,7,21,8],[27,1,27,8]]}
[]
[]
[]
[]
[]
[]
[]
[]
[]
[]
[]
[]
[null,"Clemens de Mol"]
[]
[]
[null,"Gespeeld",null,null,null,{"$f":"COUNTIF(G32:G57,\"W\")+COUNTIF(G32:G57,\"G\")+COUNTIF(G32:G57,\"V\")","v":3}]
[null,"Gewonnen",null,null,null,{"$f":"COUNTIF(G32:G57,\"W\")","v":0}]
[null,"Gelijk",null,null,null,{"$f":"COUNTIF(G32:G57,\"G\")","v":1}]
[null,"Verloren",null,null,null,{"$f":"COUNTIF(G32:G57,\"V\")","v":2},null,"Wijk van initiële inschrijving\n(met shirtkleur finaledag)"]
[null,"% gewonnen",null,null,null,{"$f":"IF(F16=0,0,F17/F16)","v":0}]
[null,"% gelijk",null,null,null,{"$f":"IF(F16=0,0,F18/F16)","v":0.33333333333333331}]
[null,"% verloren",null,null,null,{"$f":"IF(F16=0,0,F19/F16)","v":0.66666666666666663},null,"'s-Hertogenbosch Zuid"]
[null,"Wedstrijdpunten",null,null,null,{"$f":"SUM(H32:H57)","v":2}]
[null,"Saldopunten",null,null,null,{"$f":"SUM(I32:I57)","v":-24}]
[null,"Saldopunten per wedstrijd",null,null,null,{"$f":"IF(F16=0,0,F24/F16)","v":-8}]
[]
[]
[null,"LET OP: alleen wedstrijden die daadwerkelijk gespeeld zijn in de wijk waarvoor jij je hebt ingeschreven tellen mee!"]
[]
[]
[null,"Datum","Locatie","UITSLAGEN",null,null,"W, V of G?","Wedstrijd-punten","Saldo-punten"]
[null,"2021-06-18","'s-Hertogenbosch Zuid",1,"-",13,{"$f":"IF(OR($B$13=\"\",wijk_van_inschrijving=\"\"),\"-\",IF(OR(wijk_van_inschrijving<>C32,D32=\"\",F32=\"\"),\"-\",IF(D32>F32,\"W\",IF(D32=F32,\"G\",IF(D32<F32,\"V\",\"-\")))))","v":"V"},{"$f":"IF(OR($B$13=\"\",wijk_van_inschrijving=\"\"),\"-\",IF(OR(wijk_van_inschrijving<>C32,G32=\"-\",G32=\"\"),\"-\",IF(G32=\"W\",3,IF(G32=\"G\",2,IF(G32=\"V\",0,0)))))","v":0},{"$f":"IF(OR($B$13=\"\",wijk_van_inschrijving=\"\"),\"-\",IF(wijk_van_inschrijving<>C32,\"-\",IF(D32>=0,IF(F32=\"\",\"-\",D32-F32))))","v":-12}]
[null,"2021-06-18","'s-Hertogenbosch Zuid",4,"-",4,"G",2,0]
[null,"2021-06-18","'s-Hertogenbosch Zuid",1,"-",13,"V",0,-12]
[null,null,null,null,"-",null,"-","-","-"]
[null,null,null,null,"-",null,"-","-","-"]
[null,null,null,null,"-",null,"-","-","-"]
[null,null,null,null,"-",null,"-","-","-"]
[null,null,null,null,"-",null,"-","-","-"]
[null,null,null,null,"-",null,"-","-","-"]
[null,null,null,null,"-",null,"-","-","-"]
[null,null,null,null,"-",null,"-","-","-"]
[null,null,null,null,"-",null,"-","-","-"]
[null,null,null,null,"-",null,"-","-","-"]
[null,null,null,null,"-",null,"-","-","-"]
[null,null,null,null,"-",null,"-","-","-"]
[null,null,null,null,"-",null,"-","-","-"]
[null,null,null,null,"-",null,"-","-","-"]
[null,null,null,null,"-",null,"-","-","-"]
[null,null,null,null,"-",null,"-","-","-"]
[null,null,null,null,"-",null,"-","-","-"]
[null,null,null,null,"-",null,"-","-","-"]
[null,null,null,null,"-",null,"-","-","-"]
[null,null,null,null,"-",null,"-","-","-"]
[null,null,null,null,"-",null,"-","-","-"]
[null,null,null,null,"-",null,"-","-","-"]

{"sheet":"Coby Hendriks","index":17,"n_rows":56,"n_cols":9,"rows_kept":56,"cut":false,"hidden":false,"merged":[[18,7,20,8],[30,3,30,5],[12,1,12,8],[15,1,15,4],[16,1,16,4],[17,1,17,4],[18,1,18,4],[19,1,19,4],[20,1,20,4],[21,1,21,4],[22,1,22,4],[23,1,23,4],[24,1,24,4],[21,7,21,8],[27,1,27,8]]}
[]
[]
[]
[]
[]
[]
[]
[]
[]
[]
[]
[]
[null,"Coby Hendriks"]
[]
[]
[null,"Gespeeld",null,null,null,{"$f":"COUNTIF(G32:G57,\"W\")+COUNTIF(G32:G57,\"G\")+COUNTIF(G32:G57,\"V\")","v":12}]
[null,"Gewonnen",null,null,null,{"$f":"COUNTIF(G32:G57,\"W\")","v":1}]
[null,"Gelijk",null,null,null,{"$f":"COUNTIF(G32:G57,\"G\")","v":0}]
[null,"Verloren",null,null,null,{"$f":"COUNTIF(G32:G57,\"V\")","v":11},null,"Wijk van initiële inschrijving\n(met shirtkleur finaledag)"]
[null,"% gewonnen",null,null,null,{"$f":"IF(F16=0,0,F17/F16)","v":8.3333333333333329E-2}]
[null,"% gelijk",null,null,null,{"$f":"IF(F16=0,0,F18/F16)","v":0}]
[null,"% verloren",null,null,null,{"$f":"IF(F16=0,0,F19/F16)","v":0.91666666666666663},null,"De Schutskamp"]
[null,"Wedstrijdpunten",null,null,null,{"$f":"SUM(H32:H57)","v":3}]
[null,"Saldopunten",null,null,null,{"$f":"SUM(I32:I57)","v":-74}]
[null,"Saldopunten per wedstrijd",null,null,null,{"$f":"IF(F16=0,0,F24/F16)","v":-6.166666666666667}]
[]
[]
[null,"LET OP: alleen wedstrijden die daadwerkelijk gespeeld zijn in de wijk waarvoor jij je hebt ingeschreven tellen mee!"]
[]
[]
[null,"Datum","Locatie","UITSLAGEN",null,null,"W, V of G?","Wedstrijd-punten","Saldo-punten"]
[null,"2021-06-14","De Schutskamp",4,"-",7,{"$f":"IF(OR($B$13=\"\",wijk_van_inschrijving=\"\"),\"-\",IF(OR(wijk_van_inschrijving<>C32,D32=\"\",F32=\"\"),\"-\",IF(D32>F32,\"W\",IF(D32=F32,\"G\",IF(D32<F32,\"V\",\"-\")))))","v":"V"},{"$f":"IF(OR($B$13=\"\",wijk_van_inschrijving=\"\"),\"-\",IF(OR(wijk_van_inschrijving<>C32,G32=\"-\",G32=\"\"),\"-\",IF(G32=\"W\",3,IF(G32=\"G\",2,IF(G32=\"V\",0,0)))))","v":0},{"$f":"IF(OR($B$13=\"\",wijk_van_inschrijving=\"\"),\"-\",IF(wijk_van_inschrijving<>C32,\"-\",IF(D32>=0,IF(F32=\"\",\"-\",D32-F32))))","v":-3}]
[null,"2021-06-14","De Schutskamp",4,"-",7,"V",0,-3]
[null,"2021-06-14","De Schutskamp",4,"-",13,"V",0,-9]
[null,"2021-06-24","De Schutskamp",13,"-",8,"W",3,5]
[null,"2021-06-24","De Schutskamp",1,"-",13,"V",0,-12]
[null,"2021-06-24","De Schutskamp",8,"-",12,"V",0,-4]
[null,"2021-06-28","De Schutskamp",4,"-",8,"V",0,-4]
[null,"2021-06-28","De Schutskamp",1,"-",13,"V",0,-12]
[null,"2021-06-28","De Schutskamp",1,"-",7,"V",0,-6]
[null,"2021-07-05","De Schutskamp",5,"-",7,"V",0,-2]
[null,"2021-07-05","De Schutskamp",2,"-",13,"V",0,-11]
[null,"2021-07-05","De Schutskamp",0,"-",13,"V",0,-13]
[null,null,null,null,"-",null,"-","-","-"]
[null,null,null,null,"-",null,"-","-","-"]
[null,null,null,null,"-",null,"-","-","-"]
[null,null,null,null,"-",null,"-","-","-"]
[null,null,null,null,"-",null,"-","-","-"]
[null,null,null,null,"-",null,"-","-","-"]
[null,null,null,null,"-",null,"-","-","-"]
[null,null,null,null,"-",null,"-","-","-"]
[null,null,null,null,"-",null,"-","-","-"]
[null,null,null,null,"-",null,"-","-","-"]
[null,null,null,null,"-",null,"-","-","-"]
[null,null,null,null,"-",null,"-","-","-"]
[null,null,null,null,"-",null,"-","-","-"]

{"sheet":"Coen van den Bogaard","index":18,"n_rows":56,"n_cols":9,"rows_kept":56,"cut":false,"hidden":false,"merged":[[19,1,19,4],[12,1,12,8],[15,1,15,4],[16,1,16,4],[17,1,17,4],[18,1,18,4],[18,7,20,8],[27,1,27,8],[30,3,30,5],[20,1,20,4],[21,7,21,8],[21,1,21,4],[22,1,22,4],[23,1,23,4],[24,1,24,4]]}
[]
[]
[]
[]
[]
[]
[]
[]
[]
[]
[]
[]
[null,"Coen van den Bogaard"]
[]
[]
[null,"Gespeeld",null,null,null,{"$f":"COUNTIF(G32:G57,\"W\")+COUNTIF(G32:G57,\"G\")+COUNTIF(G32:G57,\"V\")","v":3}]
[null,"Gewonnen",null,null,null,{"$f":"COUNTIF(G32:G57,\"W\")","v":0}]
[null,"Gelijk",null,null,null,{"$f":"COUNTIF(G32:G57,\"G\")","v":0}]
[null,"Verloren",null,null,null,{"$f":"COUNTIF(G32:G57,\"V\")","v":3},null,"Wijk van initiële inschrijving\n(met shirtkleur finaledag)"]
[null,"% gewonnen",null,null,null,{"$f":"IF(F16=0,0,F17/F16)","v":0}]
[null,"% gelijk",null,null,null,{"$f":"IF(F16=0,0,F18/F16)","v":0}]
[null,"% verloren",null,null,null,{"$f":"IF(F16=0,0,F19/F16)","v":1},null,"De Hambaken"]
[null,"Wedstrijdpunten",null,null,null,{"$f":"SUM(H32:H57)","v":0}]
[null,"Saldopunten",null,null,null,{"$f":"SUM(I32:I57)","v":-13}]
[null,"Saldopunten per wedstrijd",null,null,null,{"$f":"IF(F16=0,0,F24/F16)","v":-4.333333333333333}]
[]
[]
[null,"LET OP: alleen wedstrijden die daadwerkelijk gespeeld zijn in de wijk waarvoor jij je hebt ingeschreven tellen mee!"]
[]
[]
[null,"Datum","Locatie","UITSLAGEN",null,null,"W, V of G?","Wedstrijd-punten","Saldo-punten"]
[null,"2021-06-29","De Hambaken",4,"-",10,{"$f":"IF(OR($B$13=\"\",wijk_van_inschrijving=\"\"),\"-\",IF(OR(wijk_van_inschrijving<>C32,D32=\"\",F32=\"\"),\"-\",IF(D32>F32,\"W\",IF(D32=F32,\"G\",IF(D32<F32,\"V\",\"-\")))))","v":"V"},{"$f":"IF(OR($B$13=\"\",wijk_van_inschrijving=\"\"),\"-\",IF(OR(wijk_van_inschrijving<>C32,G32=\"-\",G32=\"\"),\"-\",IF(G32=\"W\",3,IF(G32=\"G\",2,IF(G32=\"V\",0,0)))))","v":0},{"$f":"IF(OR($B$13=\"\",wijk_van_inschrijving=\"\"),\"-\",IF(wijk_van_inschrijving<>C32,\"-\",IF(D32>=0,IF(F32=\"\",\"-\",D32-F32))))","v":-6}]
[null,"2021-06-29","De Hambaken",2,"-",8,"V",0,-6]
[null,"2021-06-29","De Hambaken",12,"-",13,"V",0,-1]
[null,null,null,null,"-",null,"-","-","-"]
[null,null,null,null,"-",null,"-","-","-"]
[null,null,null,null,"-",null,"-","-","-"]
[null,null,null,null,"-",null,"-","-","-"]
[null,null,null,null,"-",null,"-","-","-"]
[null,null,null,null,"-",null,"-","-","-"]
[null,null,null,null,"-",null,"-","-","-"]
[null,null,null,null,"-",null,"-","-","-"]
[null,null,null,null,"-",null,"-","-","-"]
[null,null,null,null,"-",null,"-","-","-"]
[null,null,null,null,"-",null,"-","-","-"]
[null,null,null,null,"-",null,"-","-","-"]
[null,null,null,null,"-",null,"-","-","-"]
[null,null,null,null,"-",null,"-","-","-"]
[null,null,null,null,"-",null,"-","-","-"]
[null,null,null,null,"-",null,"-","-","-"]
[null,null,null,null,"-",null,"-","-","-"]
[null,null,null,null,"-",null,"-","-","-"]
[null,null,null,null,"-",null,"-","-","-"]
[null,null,null,null,"-",null,"-","-","-"]
[null,null,null,null,"-",null,"-","-","-"]
[null,null,null,null,"-",null,"-","-","-"]

{"sheet":"Cor Geerts","index":19,"n_rows":56,"n_cols":9,"rows_kept":56,"cut":false,"hidden":false,"merged":[[18,7,20,8],[30,3,30,5],[12,1,12,8],[15,1,15,4],[16,1,16,4],[17,1,17,4],[18,1,18,4],[19,1,19,4],[20,1,20,4],[21,1,21,4],[22,1,22,4],[23,1,23,4],[24,1,24,4],[21,7,21,8],[27,1,27,8]]}
[]
[]
[]
[]
[]
[]
[]
[]
[]
[]
[]
[]
[null,"Cor Geerts"]
[]
[]
[null,"Gespeeld",null,null,null,{"$f":"COUNTIF(G32:G57,\"W\")+COUNTIF(G32:G57,\"G\")+COUNTIF(G32:G57,\"V\")","v":8}]
[null,"Gewonnen",null,null,null,{"$f":"COUNTIF(G32:G57,\"W\")","v":3}]
[null,"Gelijk",null,null,null,{"$f":"COUNTIF(G32:G57,\"G\")","v":0}]
[null,"Verloren",null,null,null,{"$f":"COUNTIF(G32:G57,\"V\")","v":5},null,"Wijk van initiële inschrijving\n(met shirtkleur finaledag)"]
[null,"% gewonnen",null,null,null,{"$f":"IF(F16=0,0,F17/F16)","v":0.375}]
[null,"% gelijk",null,null,null,{"$f":"IF(F16=0,0,F18/F16)","v":0}]
[null,"% verloren",null,null,null,{"$f":"IF(F16=0,0,F19/F16)","v":0.625},null,"Hondsberg (Rosmalen)"]
[null,"Wedstrijdpunten",null,null,null,{"$f":"SUM(H32:H57)","v":9}]
[null,"Saldopunten",null,null,null,{"$f":"SUM(I32:I57)","v":1}]
[null,"Saldopunten per wedstrijd",null,null,null,{"$f":"IF(F16=0,0,F24/F16)","v":0.125}]
[]
[]
[null,"LET OP: alleen wedstrijden die daadwerkelijk gespeeld zijn in de wijk waarvoor jij je hebt ingeschreven tellen mee!"]
[]
[]
[null,"Datum","Locatie","UITSLAGEN",null,null,"W, V of G?","Wedstrijd-punten","Saldo-punten"]
[null,"2021-06-15","Hondsberg (Rosmalen)",5,"-",8,{"$f":"IF(OR($B$13=\"\",wijk_van_inschrijving=\"\"),\"-\",IF(OR(wijk_van_inschrijving<>C32,D32=\"\",F32=\"\"),\"-\",IF(D32>F32,\"W\",IF(D32=F32,\"G\",IF(D32<F32,\"V\",\"-\")))))","v":"V"},{"$f":"IF(OR($B$13=\"\",wijk_van_inschrijving=\"\"),\"-\",IF(OR(wijk_van_inschrijving<>C32,G32=\"-\",G32=\"\"),\"-\",IF(G32=\"W\",3,IF(G32=\"G\",2,IF(G32=\"V\",0,0)))))","v":0},{"$f":"IF(OR($B$13=\"\",wijk_van_inschrijving=\"\"),\"-\",IF(wijk_van_inschrijving<>C32,\"-\",IF(D32>=0,IF(F32=\"\",\"-\",D32-F32))))","v":-3}]
[null,"2021-06-15","Hondsberg (Rosmalen)",5,"-",8,"V",0,-3]
[null,"2021-06-15","Hondsberg (Rosmalen)",13,"-",6,"W",3,7]
[null,"2021-06-22","Hondsberg (Rosmalen)",4,"-",10,"V",0,-6]
[null,"2021-06-22","Hondsberg (Rosmalen)",11,"-",5,"W",3,6]
[null,"2021-07-07","Hondsberg (Rosmalen)",5,"-",3,"W",3,2]
[null,"2021-07-07","Hondsberg (Rosmalen)",11,"-",12,"V",0,-1]
[null,"2021-07-07","Hondsberg (Rosmalen)",5,"-",6,"V",0,-1]
[null,null,null,null,"-",null,"-","-","-"]
[null,null,null,null,"-",null,"-","-","-"]
[null,null,null,null,"-",null,"-","-","-"]
[null,null,null,null,"-",null,"-","-","-"]
[null,null,null,null,"-",null,"-","-","-"]
[null,null,null,null,"-",null,"-","-","-"]
[null,null,null,null,"-",null,"-","-","-"]
[null,null,null,null,"-",null,"-","-","-"]
[null,null,null,null,"-",null,"-","-","-"]
[null,null,null,null,"-",null,"-","-","-"]
[null,null,null,null,"-",null,"-","-","-"]
[null,null,null,null,"-",null,"-","-","-"]
[null,null,null,null,"-",null,"-","-","-"]
[null,null,null,null,"-",null,"-","-","-"]
[null,null,null,null,"-",null,"-","-","-"]
[null,null,null,null,"-",null,"-","-","-"]
[null,null,null,null,"-",null,"-","-","-"]

{"sheet":"Corrie van Mil - de Looijer","index":20,"n_rows":56,"n_cols":9,"rows_kept":56,"cut":false,"hidden":false,"merged":[[18,7,20,8],[30,3,30,5],[12,1,12,8],[15,1,15,4],[16,1,16,4],[17,1,17,4],[18,1,18,4],[19,1,19,4],[20,1,20,4],[21,1,21,4],[22,1,22,4],[23,1,23,4],[24,1,24,4],[21,7,21,8],[27,1,27,8]]}
[]
[]
[]
[]
[]
[]
[]
[]
[]
[]
[]
[]
[null,"Corrie van Mil - de Looijer"]
[]
[]
[null,"Gespeeld",null,null,null,{"$f":"COUNTIF(G32:G57,\"W\")+COUNTIF(G32:G57,\"G\")+COUNTIF(G32:G57,\"V\")","v":9}]
[null,"Gewonnen",null,null,null,{"$f":"COUNTIF(G32:G57,\"W\")","v":8}]
[null,"Gelijk",null,null,null,{"$f":"COUNTIF(G32:G57,\"G\")","v":1}]
[null,"Verloren",null,null,null,{"$f":"COUNTIF(G32:G57,\"V\")","v":0},null,"Wijk van initiële inschrijving\n(met shirtkleur finaledag)"]
[null,"% gewonnen",null,null,null,{"$f":"IF(F16=0,0,F17/F16)","v":0.88888888888888884}]
[null,"% gelijk",null,null,null,{"$f":"IF(F16=0,0,F18/F16)","v":0.1111111111111111}]
[null,"% verloren",null,null,null,{"$f":"IF(F16=0,0,F19/F16)","v":0},null,"De Schutskamp"]
[null,"Wedstrijdpunten",null,null,null,{"$f":"SUM(H32:H57)","v":26}]
[null,"Saldopunten",null,null,null,{"$f":"SUM(I32:I57)","v":36}]
[null,"Saldopunten per wedstrijd",null,null,null,{"$f":"IF(F16=0,0,F24/F16)","v":4}]
[]
[]
[null,"LET OP: alleen wedstrijden die daadwerkelijk gespeeld zijn in de wijk waarvoor jij je hebt ingeschreven tellen mee!"]
[]
[]
[null,"Datum","Locatie","UITSLAGEN",null,null,"W, V of G?","Wedstrijd-punten","Saldo-punten"]
[null,"2021-06-14","De Schutskamp",8,"-",4,{"$f":"IF(OR($B$13=\"\",wijk_van_inschrijving=\"\"),\"-\",IF(OR(wijk_van_inschrijving<>C32,D32=\"\",F32=\"\"),\"-\",IF(D32>F32,\"W\",IF(D32=F32,\"G\",IF(D32<F32,\"V\",\"-\")))))","v":"W"},{"$f":"IF(OR($B$13=\"\",wijk_van_inschrijving=\"\"),\"-\",IF(OR(wijk_van_inschrijving<>C32,G32=\"-\",G32=\"\"),\"-\",IF(G32=\"W\",3,IF(G32=\"G\",2,IF(G32=\"V\",0,0)))))","v":3},{"$f":"IF(OR($B$13=\"\",wijk_van_inschrijving=\"\"),\"-\",IF(wijk_van_inschrijving<>C32,\"-\",IF(D32>=0,IF(F32=\"\",\"-\",D32-F32))))","v":4}]
[null,"2021-06-14","De Schutskamp",7,"-",4,"W",3,3]
[null,"2021-06-14","De Schutskamp",9,"-",5,"W",3,4]
[null,"2021-06-24","De Schutskamp",5,"-",5,"G",2,0]
[null,"2021-06-24","De Schutskamp",13,"-",1,"W",3,12]
[null,"2021-06-24","De Schutskamp",9,"-",8,"W",3,1]
[null,"2021-07-05","De Schutskamp",13,"-",6,"W",3,7]
[null,"2021-07-05","De Schutskamp",12,"-",8,"W",3,4]
[null,"2021-07-05","De Schutskamp",6,"-",5,"W",3,1]
[null,null,null,null,"-",null,"-","-","-"]
[null,null,null,null,"-",null,"-","-","-"]
[null,null,null,null,"-",null,"-","-","-"]
[null,null,null,null,"-",null,"-","-","-"]
[null,null,null,null,"-",null,"-","-","-"]
[null,null,null,null,"-",null,"-","-","-"]
[null,null,null,null,"-",null,"-","-","-"]
[null,null,null,null,"-",null,"-","-","-"]
[null,null,null,null,"-",null,"-","-","-"]
[null,null,null,null,"-",null,"-","-","-"]
[null,null,null,null,"-",null,"-","-","-"]
[null,null,null,null,"-",null,"-","-","-"]
[null,null,null,null,"-",null,"-","-","-"]
[null,null,null,null,"-",null,"-","-","-"]
[null,null,null,null,"-",null,"-","-","-"]
[null,null,null,null,"-",null,"-","-","-"]

{"sheet":"Denice Sprengers","index":21,"n_rows":56,"n_cols":9,"rows_kept":56,"cut":false,"hidden":false,"merged":[[19,1,19,4],[12,1,12,8],[15,1,15,4],[16,1,16,4],[17,1,17,4],[18,1,18,4],[18,7,20,8],[27,1,27,8],[30,3,30,5],[20,1,20,4],[21,7,21,8],[21,1,21,4],[22,1,22,4],[23,1,23,4],[24,1,24,4]]}
[]
[]
[]
[]
[]
[]
[]
[]
[]
[]
[]
[]
[null,"Denice Sprengers"]
[]
[]
[null,"Gespeeld",null,null,null,{"$f":"COUNTIF(G32:G57,\"W\")+COUNTIF(G32:G57,\"G\")+COUNTIF(G32:G57,\"V\")","v":1}]
[null,"Gewonnen",null,null,null,{"$f":"COUNTIF(G32:G57,\"W\")","v":0}]
[null,"Gelijk",null,null,null,{"$f":"COUNTIF(G32:G57,\"G\")","v":0}]
[null,"Verloren",null,null,null,{"$f":"COUNTIF(G32:G57,\"V\")","v":1},null,"Wijk van initiële inschrijving\n(met shirtkleur finaledag)"]
[null,"% gewonnen",null,null,null,{"$f":"IF(F16=0,0,F17/F16)","v":0}]
[null,"% gelijk",null,null,null,{"$f":"IF(F16=0,0,F18/F16)","v":0}]
[null,"% verloren",null,null,null,{"$f":"IF(F16=0,0,F19/F16)","v":1},null,"'s-Hertogenbosch Zuid"]
[null,"Wedstrijdpunten",null,null,null,{"$f":"SUM(H32:H57)","v":0}]
[null,"Saldopunten",null,null,null,{"$f":"SUM(I32:I57)","v":-13}]
[null,"Saldopunten per wedstrijd",null,null,null,{"$f":"IF(F16=0,0,F24/F16)","v":-13}]
[]
[]
[null,"LET OP: alleen wedstrijden die daadwerkelijk gespeeld zijn in de wijk waarvoor jij je hebt ingeschreven tellen mee!"]
[]
[]
[null,"Datum","Locatie","UITSLAGEN",null,null,"W, V of G?","Wedstrijd-punten","Saldo-punten"]
[null,"2021-07-01","'s-Hertogenbosch Zuid",0,"-",13,{"$f":"IF(OR($B$13=\"\",wijk_van_inschrijving=\"\"),\"-\",IF(OR(wijk_van_inschrijving<>C32,D32=\"\",F32=\"\"),\"-\",IF(D32>F32,\"W\",IF(D32=F32,\"G\",IF(D32<F32,\"V\",\"-\")))))","v":"V"},{"$f":"IF(OR($B$13=\"\",wijk_van_inschrijving=\"\"),\"-\",IF(OR(wijk_van_inschrijving<>C32,G32=\"-\",G32=\"\"),\"-\",IF(G32=\"W\",3,IF(G32=\"G\",2,IF(G32=\"V\",0,0)))))","v":0},{"$f":"IF(OR($B$13=\"\",wijk_van_inschrijving=\"\"),\"-\",IF(wijk_van_inschrijving<>C32,\"-\",IF(D32>=0,IF(F32=\"\",\"-\",D32-F32))))","v":-13}]
[null,null,null,null,"-",null,"-","-","-"]
[null,null,null,null,"-",null,"-","-","-"]
[null,null,null,null,"-",null,"-","-","-"]
[null,null,null,null,"-",null,"-","-","-"]
[null,null,null,null,"-",null,"-","-","-"]
[null,null,null,null,"-",null,"-","-","-"]
[null,null,null,null,"-",null,"-","-","-"]
[null,null,null,null,"-",null,"-","-","-"]
[null,null,null,null,"-",null,"-","-","-"]
[null,null,null,null,"-",null,"-","-","-"]
[null,null,null,null,"-",null,"-","-","-"]
[null,null,null,null,"-",null,"-","-","-"]
[null,null,null,null,"-",null,"-","-","-"]
[null,null,null,null,"-",null,"-","-","-"]
[null,null,null,null,"-",null,"-","-","-"]
[null,null,null,null,"-",null,"-","-","-"]
[null,null,null,null,"-",null,"-","-","-"]
[null,null,null,null,"-",null,"-","-","-"]
[null,null,null,null,"-",null,"-","-","-"]
[null,null,null,null,"-",null,"-","-","-"]
[null,null,null,null,"-",null,"-","-","-"]
[null,null,null,null,"-",null,"-","-","-"]
[null,null,null,null,"-",null,"-","-","-"]
[null,null,null,null,"-",null,"-","-","-"]

{"sheet":"Dewi van Maaren","index":22,"n_rows":56,"n_cols":9,"rows_kept":56,"cut":false,"hidden":false,"merged":[[27,1,27,8],[30,3,30,5],[20,1,20,4],[21,7,21,8],[21,1,21,4],[22,1,22,4],[23,1,23,4],[24,1,24,4],[18,7,20,8],[19,1,19,4],[12,1,12,8],[15,1,15,4],[16,1,16,4],[17,1,17,4],[18,1,18,4]]}
[]
[]
[]
[]
[]
[]
[]
[]
[]
[]
[]
[]
[null,"Dewi van Maaren"]
[]
[]
[null,"Gespeeld",null,null,null,{"$f":"COUNTIF(G32:G57,\"W\")+COUNTIF(G32:G57,\"G\")+COUNTIF(G32:G57,\"V\")","v":3}]
[null,"Gewonnen",null,null,null,{"$f":"COUNTIF(G32:G57,\"W\")","v":0}]
[null,"Gelijk",null,null,null,{"$f":"COUNTIF(G32:G57,\"G\")","v":1}]
[null,"Verloren",null,null,null,{"$f":"COUNTIF(G32:G57,\"V\")","v":2},null,"Wijk van initiële inschrijving\n(met shirtkleur finaledag)"]
[null,"% gewonnen",null,null,null,{"$f":"IF(F16=0,0,F17/F16)","v":0}]
[null,"% gelijk",null,null,null,{"$f":"IF(F16=0,0,F18/F16)","v":0.33333333333333331}]
[null,"% verloren",null,null,null,{"$f":"IF(F16=0,0,F19/F16)","v":0.66666666666666663},null,"De Schutskamp"]
[null,"Wedstrijdpunten",null,null,null,{"$f":"SUM(H32:H57)","v":2}]
[null,"Saldopunten",null,null,null,{"$f":"SUM(I32:I57)","v":-6}]
[null,"Saldopunten per wedstrijd",null,null,null,{"$f":"IF(F16=0,0,F24/F16)","v":-2}]
[]
[]
[null,"LET OP: alleen wedstrijden die daadwerkelijk gespeeld zijn in de wijk waarvoor jij je hebt ingeschreven tellen mee!"]
[]
[]
[null,"Datum","Locatie","UITSLAGEN",null,null,"W, V of G?","Wedstrijd-punten","Saldo-punten"]
[null,"2021-06-24","De Schutskamp",6,"-",8,{"$f":"IF(OR($B$13=\"\",wijk_van_inschrijving=\"\"),\"-\",IF(OR(wijk_van_inschrijving<>C32,D32=\"\",F32=\"\"),\"-\",IF(D32>F32,\"W\",IF(D32=F32,\"G\",IF(D32<F32,\"V\",\"-\")))))","v":"V"},{"$f":"IF(OR($B$13=\"\",wijk_van_inschrijving=\"\"),\"-\",IF(OR(wijk_van_inschrijving<>C32,G32=\"-\",G32=\"\"),\"-\",IF(G32=\"W\",3,IF(G32=\"G\",2,IF(G32=\"V\",0,0)))))","v":0},{"$f":"IF(OR($B$13=\"\",wijk_van_inschrijving=\"\"),\"-\",IF(wijk_van_inschrijving<>C32,\"-\",IF(D32>=0,IF(F32=\"\",\"-\",D32-F32))))","v":-2}]
[null,"2021-06-24","De Schutskamp",6,"-",10,"V",0,-4]
[null,"2021-06-24","De Schutskamp",11,"-",11,"G",2,0]
[null,null,null,null,"-",null,"-","-","-"]
[null,null,null,null,"-",null,"-","-","-"]
[null,null,null,null,"-",null,"-","-","-"]
[null,null,null,null,"-",null,"-","-","-"]
[null,null,null,null,"-",null,"-","-","-"]
[null,null,null,null,"-",null,"-","-","-"]
[null,null,null,null,"-",null,"-","-","-"]
[null,null,null,null,"-",null,"-","-","-"]
[null,null,null,null,"-",null,"-","-","-"]
[null,null,null,null,"-",null,"-","-","-"]
[null,null,null,null,"-",null,"-","-","-"]
[null,null,null,null,"-",null,"-","-","-"]
[null,null,null,null,"-",null,"-","-","-"]
[null,null,null,null,"-",null,"-","-","-"]
[null,null,null,null,"-",null,"-","-","-"]
[null,null,null,null,"-",null,"-","-","-"]
[null,null,null,null,"-",null,"-","-","-"]
[null,null,null,null,"-",null,"-","-","-"]
[null,null,null,null,"-",null,"-","-","-"]
[null,null,null,null,"-",null,"-","-","-"]
[null,null,null,null,"-",null,"-","-","-"]
[null,null,null,null,"-",null,"-","-","-"]

{"sheet":"Dick van Huijstee","index":23,"n_rows":56,"n_cols":9,"rows_kept":56,"cut":false,"hidden":false,"merged":[[18,7,20,8],[30,3,30,5],[12,1,12,8],[15,1,15,4],[16,1,16,4],[17,1,17,4],[18,1,18,4],[19,1,19,4],[20,1,20,4],[21,1,21,4],[22,1,22,4],[23,1,23,4],[24,1,24,4],[21,7,21,8],[27,1,27,8]]}
[]
[]
[]
[]
[]
[]
[]
[]
[]
[]
[]
[]
[null,"Dick van Huijstee"]
[]
[]
[null,"Gespeeld",null,null,null,{"$f":"COUNTIF(G32:G57,\"W\")+COUNTIF(G32:G57,\"G\")+COUNTIF(G32:G57,\"V\")","v":3}]
[null,"Gewonnen",null,null,null,{"$f":"COUNTIF(G32:G57,\"W\")","v":3}]
[null,"Gelijk",null,null,null,{"$f":"COUNTIF(G32:G57,\"G\")","v":0}]
[null,"Verloren",null,null,null,{"$f":"COUNTIF(G32:G57,\"V\")","v":0},null,"Wijk van initiële inschrijving\n(met shirtkleur finaledag)"]
[null,"% gewonnen",null,null,null,{"$f":"IF(F16=0,0,F17/F16)","v":1}]
[null,"% gelijk",null,null,null,{"$f":"IF(F16=0,0,F18/F16)","v":0}]
[null,"% verloren",null,null,null,{"$f":"IF(F16=0,0,F19/F16)","v":0},null,"De Hambaken"]
[null,"Wedstrijdpunten",null,null,null,{"$f":"SUM(H32:H57)","v":9}]
[null,"Saldopunten",null,null,null,{"$f":"SUM(I32:I57)","v":7}]
[null,"Saldopunten per wedstrijd",null,null,null,{"$f":"IF(F16=0,0,F24/F16)","v":2.3333333333333335}]
[]
[]
[null,"LET OP: alleen wedstrijden die daadwerkelijk gespeeld zijn in de wijk waarvoor jij je hebt ingeschreven tellen mee!"]
[]
[]
[null,"Datum","Locatie","UITSLAGEN",null,null,"W, V of G?","Wedstrijd-punten","Saldo-punten"]
[null,"2021-06-16","De Hambaken",9,"-",4,{"$f":"IF(OR($B$13=\"\",wijk_van_inschrijving=\"\"),\"-\",IF(OR(wijk_van_inschrijving<>C32,D32=\"\",F32=\"\"),\"-\",IF(D32>F32,\"W\",IF(D32=F32,\"G\",IF(D32<F32,\"V\",\"-\")))))","v":"W"},{"$f":"IF(OR($B$13=\"\",wijk_van_inschrijving=\"\"),\"-\",IF(OR(wijk_van_inschrijving<>C32,G32=\"-\",G32=\"\"),\"-\",IF(G32=\"W\",3,IF(G32=\"G\",2,IF(G32=\"V\",0,0)))))","v":3},{"$f":"IF(OR($B$13=\"\",wijk_van_inschrijving=\"\"),\"-\",IF(wijk_van_inschrijving<>C32,\"-\",IF(D32>=0,IF(F32=\"\",\"-\",D32-F32))))","v":5}]
[null,"2021-06-16","De Hambaken",7,"-",6,"W",3,1]
[null,"2021-06-16","De Hambaken",7,"-",6,"W",3,1]
[null,null,null,null,"-",null,"-","-","-"]
[null,null,null,null,"-",null,"-","-","-"]
[null,null,null,null,"-",null,"-","-","-"]
[null,null,null,null,"-",null,"-","-","-"]
[null,null,null,null,"-",null,"-","-","-"]
[null,null,null,null,"-",null,"-","-","-"]
[null,null,null,null,"-",null,"-","-","-"]
[null,null,null,null,"-",null,"-","-","-"]
[null,null,null,null,"-",null,"-","-","-"]
[null,null,null,null,"-",null,"-","-","-"]
[null,null,null,null,"-",null,"-","-","-"]
[null,null,null,null,"-",null,"-","-","-"]
[null,null,null,null,"-",null,"-","-","-"]
[null,null,null,null,"-",null,"-","-","-"]
[null,null,null,null,"-",null,"-","-","-"]
[null,null,null,null,"-",null,"-","-","-"]
[null,null,null,null,"-",null,"-","-","-"]
[null,null,null,null,"-",null,"-","-","-"]
[null,null,null,null,"-",null,"-","-","-"]
[null,null,null,null,"-",null,"-","-","-"]
[null,null,null,null,"-",null,"-","-","-"]
[null,null,null,null,"-",null,"-","-","-"]

{"sheet":"Diny Lommers","index":24,"n_rows":56,"n_cols":9,"rows_kept":56,"cut":false,"hidden":false,"merged":[[18,7,20,8],[30,3,30,5],[12,1,12,8],[15,1,15,4],[16,1,16,4],[17,1,17,4],[18,1,18,4],[19,1,19,4],[20,1,20,4],[21,1,21,4],[22,1,22,4],[23,1,23,4],[24,1,24,4],[21,7,21,8],[27,1,27,8]]}
[]
[]
[]
[]
[]
[]
[]
[]
[]
[]
[]
[]
[null,"Diny Lommers"]
[]
[]
[null,"Gespeeld",null,null,null,{"$f":"COUNTIF(G32:G57,\"W\")+COUNTIF(G32:G57,\"G\")+COUNTIF(G32:G57,\"V\")","v":9}]
[null,"Gewonnen",null,null,null,{"$f":"COUNTIF(G32:G57,\"W\")","v":2}]
[null,"Gelijk",null,null,null,{"$f":"COUNTIF(G32:G57,\"G\")","v":0}]
[null,"Verloren",null,null,null,{"$f":"COUNTIF(G32:G57,\"V\")","v":7},null,"Wijk van initiële inschrijving\n(met shirtkleur finaledag)"]
[null,"% gewonnen",null,null,null,{"$f":"IF(F16=0,0,F17/F16)","v":0.22222222222222221}]
[null,"% gelijk",null,null,null,{"$f":"IF(F16=0,0,F18/F16)","v":0}]
[null,"% verloren",null,null,null,{"$f":"IF(F16=0,0,F19/F16)","v":0.77777777777777779},null,"De Schutskamp"]
[null,"Wedstrijdpunten",null,null,null,{"$f":"SUM(H32:H57)","v":6}]
[null,"Saldopunten",null,null,null,{"$f":"SUM(I32:I57)","v":-14}]
[null,"Saldopunten per wedstrijd",null,null,null,{"$f":"IF(F16=0,0,F24/F16)","v":-1.5555555555555556}]
[]
[]
[null,"LET OP: alleen wedstrijden die daadwerkelijk gespeeld zijn in de wijk waarvoor jij je hebt ingeschreven tellen mee!"]
[]
[]
[null,"Datum","Locatie","UITSLAGEN",null,null,"W, V of G?","Wedstrijd-punten","Saldo-punten"]
[null,"2021-06-14","De Schutskamp",4,"-",7,{"$f":"IF(OR($B$13=\"\",wijk_van_inschrijving=\"\"),\"-\",IF(OR(wijk_van_inschrijving<>C32,D32=\"\",F32=\"\"),\"-\",IF(D32>F32,\"W\",IF(D32=F32,\"G\",IF(D32<F32,\"V\",\"-\")))))","v":"V"},{"$f":"IF(OR($B$13=\"\",wijk_van_inschrijving=\"\"),\"-\",IF(OR(wijk_van_inschrijving<>C32,G32=\"-\",G32=\"\"),\"-\",IF(G32=\"W\",3,IF(G32=\"G\",2,IF(G32=\"V\",0,0)))))","v":0},{"$f":"IF(OR($B$13=\"\",wijk_van_inschrijving=\"\"),\"-\",IF(wijk_van_inschrijving<>C32,\"-\",IF(D32>=0,IF(F32=\"\",\"-\",D32-F32))))","v":-3}]
[null,"2021-06-14","De Schutskamp",3,"-",4,"V",0,-1]
[null,"2021-06-14","De Schutskamp",5,"-",9,"V",0,-4]
[null,"2021-06-24","De Schutskamp",8,"-",13,"V",0,-5]
[null,"2021-06-24","De Schutskamp",6,"-",10,"V",0,-4]
[null,"2021-06-24","De Schutskamp",7,"-",11,"V",0,-4]
[null,"2021-06-28","De Schutskamp",13,"-",5,"W",3,8]
[null,"2021-06-28","De Schutskamp",3,"-",5,"V",0,-2]
[null,"2021-06-28","De Schutskamp",8,"-",7,"W",3,1]
[null,null,null,null,"-",null,"-","-","-"]
[null,null,null,null,"-",null,"-","-","-"]
[null,null,null,null,"-",null,"-","-","-"]
[null,null,null,null,"-",null,"-","-","-"]
[null,null,null,null,"-",null,"-","-","-"]
[null,null,null,null,"-",null,"-","-","-"]
[null,null,null,null,"-",null,"-","-","-"]
[null,null,null,null,"-",null,"-","-","-"]
[null,null,null,null,"-",null,"-","-","-"]
[null,null,null,null,"-",null,"-","-","-"]
[null,null,null,null,"-",null,"-","-","-"]
[null,null,null,null,"-",null,"-","-","-"]
[null,null,null,null,"-",null,"-","-","-"]
[null,null,null,null,"-",null,"-","-","-"]
[null,null,null,null,"-",null,"-","-","-"]
[null,null,null,null,"-",null,"-","-","-"]

{"sheet":"Diny van de Weijenberg","index":25,"n_rows":56,"n_cols":9,"rows_kept":56,"cut":false,"hidden":false,"merged":[[27,1,27,8],[30,3,30,5],[20,1,20,4],[21,7,21,8],[21,1,21,4],[22,1,22,4],[23,1,23,4],[24,1,24,4],[18,7,20,8],[19,1,19,4],[12,1,12,8],[15,1,15,4],[16,1,16,4],[17,1,17,4],[18,1,18,4]]}
[]
[]
[]
[]
[]
[]
[]
[]
[]
[]
[]
[]
[null,"Diny van de Weijenberg"]
[]
[]
[null,"Gespeeld",null,null,null,{"$f":"COUNTIF(G32:G57,\"W\")+COUNTIF(G32:G57,\"G\")+COUNTIF(G32:G57,\"V\")","v":6}]
[null,"Gewonnen",null,null,null,{"$f":"COUNTIF(G32:G57,\"W\")","v":1}]
[null,"Gelijk",null,null,null,{"$f":"COUNTIF(G32:G57,\"G\")","v":0}]
[null,"Verloren",null,null,null,{"$f":"COUNTIF(G32:G57,\"V\")","v":5},null,"Wijk van initiële inschrijving\n(met shirtkleur finaledag)"]
[null,"% gewonnen",null,null,null,{"$f":"IF(F16=0,0,F17/F16)","v":0.16666666666666666}]
[null,"% gelijk",null,null,null,{"$f":"IF(F16=0,0,F18/F16)","v":0}]
[null,"% verloren",null,null,null,{"$f":"IF(F16=0,0,F19/F16)","v":0.83333333333333337},null,"De Schutskamp"]
[null,"Wedstrijdpunten",null,null,null,{"$f":"SUM(H32:H57)","v":3}]
[null,"Saldopunten",null,null,null,{"$f":"SUM(I32:I57)","v":-51}]
[null,"Saldopunten per wedstrijd",null,null,null,{"$f":"IF(F16=0,0,F24/F16)","v":-8.5}]
[]
[]
[null,"LET OP: alleen wedstrijden die daadwerkelijk gespeeld zijn in de wijk waarvoor jij je hebt ingeschreven tellen mee!"]
[]
[]
[null,"Datum","Locatie","UITSLAGEN",null,null,"W, V of G?","Wedstrijd-punten","Saldo-punten"]
[null,"2021-06-28","De Schutskamp",3,"-",12,{"$f":"IF(OR($B$13=\"\",wijk_van_inschrijving=\"\"),\"-\",IF(OR(wijk_van_inschrijving<>C32,D32=\"\",F32=\"\"),\"-\",IF(D32>F32,\"W\",IF(D32=F32,\"G\",IF(D32<F32,\"V\",\"-\")))))","v":"V"},{"$f":"IF(OR($B$13=\"\",wijk_van_inschrijving=\"\"),\"-\",IF(OR(wijk_van_inschrijving<>C32,G32=\"-\",G32=\"\"),\"-\",IF(G32=\"W\",3,IF(G32=\"G\",2,IF(G32=\"V\",0,0)))))","v":0},{"$f":"IF(OR($B$13=\"\",wijk_van_inschrijving=\"\"),\"-\",IF(wijk_van_inschrijving<>C32,\"-\",IF(D32>=0,IF(F32=\"\",\"-\",D32-F32))))","v":-9}]
[null,"2021-06-28","De Schutskamp",4,"-",13,"V",0,-9]
[null,"2021-06-28","De Schutskamp",2,"-",13,"V",0,-11]
[null,"2021-07-05","De Schutskamp",7,"-",5,"W",3,2]
[null,"2021-07-05","De Schutskamp",2,"-",13,"V",0,-11]
[null,"2021-07-05","De Schutskamp",0,"-",13,"V",0,-13]
[null,null,null,null,"-",null,"-","-","-"]
[null,null,null,null,"-",null,"-","-","-"]
[null,null,null,null,"-",null,"-","-","-"]
[null,null,null,null,"-",null,"-","-","-"]
[null,null,null,null,"-",null,"-","-","-"]
[null,null,null,null,"-",null,"-","-","-"]
[null,null,null,null,"-",null,"-","-","-"]
[null,null,null,null,"-",null,"-","-","-"]
[null,null,null,null,"-",null,"-","-","-"]
[null,null,null,null,"-",null,"-","-","-"]
[null,null,null,null,"-",null,"-","-","-"]
[null,null,null,null,"-",null,"-","-","-"]
[null,null,null,null,"-",null,"-","-","-"]
[null,null,null,null,"-",null,"-","-","-"]
[null,null,null,null,"-",null,"-","-","-"]
[null,null,null,null,"-",null,"-","-","-"]
[null,null,null,null,"-",null,"-","-","-"]
[null,null,null,null,"-",null,"-","-","-"]
[null,null,null,null,"-",null,"-","-","-"]

{"sheet":"Driss Lamjaata","index":26,"n_rows":56,"n_cols":9,"rows_kept":56,"cut":false,"hidden":false,"merged":[[18,7,20,8],[30,3,30,5],[12,1,12,8],[15,1,15,4],[16,1,16,4],[17,1,17,4],[18,1,18,4],[19,1,19,4],[20,1,20,4],[21,1,21,4],[22,1,22,4],[23,1,23,4],[24,1,24,4],[21,7,21,8],[27,1,27,8]]}
[]
[]
[]
[]
[]
[]
[]
[]
[]
[]
[]
[]
[null,"Driss Lamjaata"]
[]
[]
[null,"Gespeeld",null,null,null,{"$f":"COUNTIF(G32:G57,\"W\")+COUNTIF(G32:G57,\"G\")+COUNTIF(G32:G57,\"V\")","v":12}]
[null,"Gewonnen",null,null,null,{"$f":"COUNTIF(G32:G57,\"W\")","v":5}]
[null,"Gelijk",null,null,null,{"$f":"COUNTIF(G32:G57,\"G\")","v":0}]
[null,"Verloren",null,null,null,{"$f":"COUNTIF(G32:G57,\"V\")","v":7},null,"Wijk van initiële inschrijving\n(met shirtkleur finaledag)"]
[null,"% gewonnen",null,null,null,{"$f":"IF(F16=0,0,F17/F16)","v":0.41666666666666669}]
[null,"% gelijk",null,null,null,{"$f":"IF(F16=0,0,F18/F16)","v":0}]
[null,"% verloren",null,null,null,{"$f":"IF(F16=0,0,F19/F16)","v":0.58333333333333337},null,"De Schutskamp"]
[null,"Wedstrijdpunten",null,null,null,{"$f":"SUM(H32:H57)","v":15}]
[null,"Saldopunten",null,null,null,{"$f":"SUM(I32:I57)","v":-18}]
[null,"Saldopunten per wedstrijd",null,null,null,{"$f":"IF(F16=0,0,F24/F16)","v":-1.5}]
[]
[]
[null,"LET OP: alleen wedstrijden die daadwerkelijk gespeeld zijn in de wijk waarvoor jij je hebt ingeschreven tellen mee!"]
[]
[]
[null,"Datum","Locatie","UITSLAGEN",null,null,"W, V of G?","Wedstrijd-punten","Saldo-punten"]
[null,"2021-06-14","De Schutskamp",13,"-",7,{"$f":"IF(OR($B$13=\"\",wijk_van_inschrijving=\"\"),\"-\",IF(OR(wijk_van_inschrijving<>C32,D32=\"\",F32=\"\"),\"-\",IF(D32>F32,\"W\",IF(D32=F32,\"G\",IF(D32<F32,\"V\",\"-\")))))","v":"W"},{"$f":"IF(OR($B$13=\"\",wijk_van_inschrijving=\"\"),\"-\",IF(OR(wijk_van_inschrijving<>C32,G32=\"-\",G32=\"\"),\"-\",IF(G32=\"W\",3,IF(G32=\"G\",2,IF(G32=\"V\",0,0)))))","v":3},{"$f":"IF(OR($B$13=\"\",wijk_van_inschrijving=\"\"),\"-\",IF(wijk_van_inschrijving<>C32,\"-\",IF(D32>=0,IF(F32=\"\",\"-\",D32-F32))))","v":6}]
[null,"2021-06-14","De Schutskamp",5,"-",8,"V",0,-3]
[null,"2021-06-14","De Schutskamp",4,"-",13,"V",0,-9]
[null,"2021-06-24","De Schutskamp",3,"-",13,"V",0,-10]
[null,"2021-06-24","De Schutskamp",6,"-",9,"V",0,-3]
[null,"2021-06-24","De Schutskamp",13,"-",12,"W",3,1]
[null,"2021-06-28","De Schutskamp",12,"-",3,"W",3,9]
[null,"2021-06-28","De Schutskamp",8,"-",7,"W",3,1]
[null,"2021-06-28","De Schutskamp",7,"-",1,"W",3,6]
[null,"2021-07-05","De Schutskamp",9,"-",13,"V",0,-4]
[null,"2021-07-05","De Schutskamp",3,"-",9,"V",0,-6]
[null,"2021-07-05","De Schutskamp",3,"-",9,"V",0,-6]
[null,null,null,null,"-",null,"-","-","-"]
[null,null,null,null,"-",null,"-","-","-"]
[null,null,null,null,"-",null,"-","-","-"]
[null,null,null,null,"-",null,"-","-","-"]
[null,null,null,null,"-",null,"-","-","-"]
[null,null,null,null,"-",null,"-","-","-"]
[null,null,null,null,"-",null,"-","-","-"]
[null,null,null,null,"-",null,"-","-","-"]
[null,null,null,null,"-",null,"-","-","-"]
[null,null,null,null,"-",null,"-","-","-"]
[null,null,null,null,"-",null,"-","-","-"]
[null,null,null,null,"-",null,"-","-","-"]
[null,null,null,null,"-",null,"-","-","-"]

{"sheet":"Ed van de Braak","index":27,"n_rows":56,"n_cols":9,"rows_kept":56,"cut":false,"hidden":false,"merged":[[27,1,27,8],[30,3,30,5],[20,1,20,4],[21,7,21,8],[21,1,21,4],[22,1,22,4],[23,1,23,4],[24,1,24,4],[18,7,20,8],[19,1,19,4],[12,1,12,8],[15,1,15,4],[16,1,16,4],[17,1,17,4],[18,1,18,4]]}
[]
[]
[]
[]
[]
[]
[]
[]
[]
[]
[]
[]
[null,"Ed van de Braak"]
[]
[]
[null,"Gespeeld",null,null,null,{"$f":"COUNTIF(G32:G57,\"W\")+COUNTIF(G32:G57,\"G\")+COUNTIF(G32:G57,\"V\")","v":1}]
[null,"Gewonnen",null,null,null,{"$f":"COUNTIF(G32:G57,\"W\")","v":0}]
[null,"Gelijk",null,null,null,{"$f":"COUNTIF(G32:G57,\"G\")","v":0}]
[null,"Verloren",null,null,null,{"$f":"COUNTIF(G32:G57,\"V\")","v":1},null,"Wijk van initiële inschrijving\n(met shirtkleur finaledag)"]
[null,"% gewonnen",null,null,null,{"$f":"IF(F16=0,0,F17/F16)","v":0}]
[null,"% gelijk",null,null,null,{"$f":"IF(F16=0,0,F18/F16)","v":0}]
[null,"% verloren",null,null,null,{"$f":"IF(F16=0,0,F19/F16)","v":1},null,"'s-Hertogenbosch Zuid"]
[null,"Wedstrijdpunten",null,null,null,{"$f":"SUM(H32:H57)","v":0}]
[null,"Saldopunten",null,null,null,{"$f":"SUM(I32:I57)","v":-9}]
[null,"Saldopunten per wedstrijd",null,null,null,{"$f":"IF(F16=0,0,F24/F16)","v":-9}]
[]
[]
[null,"LET OP: alleen wedstrijden die daadwerkelijk gespeeld zijn in de wijk waarvoor jij je hebt ingeschreven tellen mee!"]
[]
[]
[null,"Datum","Locatie","UITSLAGEN",null,null,"W, V of G?","Wedstrijd-punten","Saldo-punten"]
[null,"2021-06-25","'s-Hertogenbosch Zuid",4,"-",13,{"$f":"IF(OR($B$13=\"\",wijk_van_inschrijving=\"\"),\"-\",IF(OR(wijk_van_inschrijving<>C32,D32=\"\",F32=\"\"),\"-\",IF(D32>F32,\"W\",IF(D32=F32,\"G\",IF(D32<F32,\"V\",\"-\")))))","v":"V"},{"$f":"IF(OR($B$13=\"\",wijk_van_inschrijving=\"\"),\"-\",IF(OR(wijk_van_inschrijving<>C32,G32=\"-\",G32=\"\"),\"-\",IF(G32=\"W\",3,IF(G32=\"G\",2,IF(G32=\"V\",0,0)))))","v":0},{"$f":"IF(OR($B$13=\"\",wijk_van_inschrijving=\"\"),\"-\",IF(wijk_van_inschrijving<>C32,\"-\",IF(D32>=0,IF(F32=\"\",\"-\",D32-F32))))","v":-9}]
[null,null,null,null,"-",null,"-","-","-"]
[null,null,null,null,"-",null,"-","-","-"]
[null,null,null,null,"-",null,"-","-","-"]
[null,null,null,null,"-",null,"-","-","-"]
[null,null,null,null,"-",null,"-","-","-"]
[null,null,null,null,"-",null,"-","-","-"]
[null,null,null,null,"-",null,"-","-","-"]
[null,null,null,null,"-",null,"-","-","-"]
[null,null,null,null,"-",null,"-","-","-"]
[null,null,null,null,"-",null,"-","-","-"]
[null,null,null,null,"-",null,"-","-","-"]
[null,null,null,null,"-",null,"-","-","-"]
[null,null,null,null,"-",null,"-","-","-"]
[null,null,null,null,"-",null,"-","-","-"]
[null,null,null,null,"-",null,"-","-","-"]
[null,null,null,null,"-",null,"-","-","-"]
[null,null,null,null,"-",null,"-","-","-"]
[null,null,null,null,"-",null,"-","-","-"]
[null,null,null,null,"-",null,"-","-","-"]
[null,null,null,null,"-",null,"-","-","-"]
[null,null,null,null,"-",null,"-","-","-"]
[null,null,null,null,"-",null,"-","-","-"]
[null,null,null,null,"-",null,"-","-","-"]
[null,null,null,null,"-",null,"-","-","-"]

{"sheet":"Ed van der Burgh","index":28,"n_rows":56,"n_cols":9,"rows_kept":56,"cut":false,"hidden":false,"merged":[[18,7,20,8],[30,3,30,5],[12,1,12,8],[15,1,15,4],[16,1,16,4],[17,1,17,4],[18,1,18,4],[19,1,19,4],[20,1,20,4],[21,1,21,4],[22,1,22,4],[23,1,23,4],[24,1,24,4],[21,7,21,8],[27,1,27,8]]}
[]
[]
[]
[]
[]
[]
[]
[]
[]
[]
[]
[]
[null,"Ed van der Burgh"]
[]
[]
[null,"Gespeeld",null,null,null,{"$f":"COUNTIF(G32:G57,\"W\")+COUNTIF(G32:G57,\"G\")+COUNTIF(G32:G57,\"V\")","v":12}]
[null,"Gewonnen",null,null,null,{"$f":"COUNTIF(G32:G57,\"W\")","v":7}]
[null,"Gelijk",null,null,null,{"$f":"COUNTIF(G32:G57,\"G\")","v":0}]
[null,"Verloren",null,null,null,{"$f":"COUNTIF(G32:G57,\"V\")","v":5},null,"Wijk van initiële inschrijving\n(met shirtkleur finaledag)"]
[null,"% gewonnen",null,null,null,{"$f":"IF(F16=0,0,F17/F16)","v":0.58333333333333337}]
[null,"% gelijk",null,null,null,{"$f":"IF(F16=0,0,F18/F16)","v":0}]
[null,"% verloren",null,null,null,{"$f":"IF(F16=0,0,F19/F16)","v":0.41666666666666669},null,"De Hambaken"]
[null,"Wedstrijdpunten",null,null,null,{"$f":"SUM(H32:H57)","v":21}]
[null,"Saldopunten",null,null,null,{"$f":"SUM(I32:I57)","v":16}]
[null,"Saldopunten per wedstrijd",null,null,null,{"$f":"IF(F16=0,0,F24/F16)","v":1.3333333333333333}]
[]
[]
[null,"LET OP: alleen wedstrijden die daadwerkelijk gespeeld zijn in de wijk waarvoor jij je hebt ingeschreven tellen mee!"]
[]
[]
[null,"Datum","Locatie","UITSLAGEN",null,null,"W, V of G?","Wedstrijd-punten","Saldo-punten"]
[null,"2021-06-16","De Hambaken",9,"-",4,{"$f":"IF(OR($B$13=\"\",wijk_van_inschrijving=\"\"),\"-\",IF(OR(wijk_van_inschrijving<>C32,D32=\"\",F32=\"\"),\"-\",IF(D32>F32,\"W\",IF(D32=F32,\"G\",IF(D32<F32,\"V\",\"-\")))))","v":"W"},{"$f":"IF(OR($B$13=\"\",wijk_van_inschrijving=\"\"),\"-\",IF(OR(wijk_van_inschrijving<>C32,G32=\"-\",G32=\"\"),\"-\",IF(G32=\"W\",3,IF(G32=\"G\",2,IF(G32=\"V\",0,0)))))","v":3},{"$f":"IF(OR($B$13=\"\",wijk_van_inschrijving=\"\"),\"-\",IF(wijk_van_inschrijving<>C32,\"-\",IF(D32>=0,IF(F32=\"\",\"-\",D32-F32))))","v":5}]
[null,"2021-06-16","De Hambaken",6,"-",7,"V",0,-1]
[null,"2021-06-16","De Hambaken",6,"-",7,"V",0,-1]
[null,"2021-06-23","De Hambaken",8,"-",13,"V",0,-5]
[null,"2021-06-23","De Hambaken",9,"-",4,"W",3,5]
[null,"2021-06-23","De Hambaken",13,"-",10,"W",3,3]
[null,"2021-06-29","De Hambaken",4,"-",10,"V",0,-6]
[null,"2021-06-29","De Hambaken",8,"-",2,"W",3,6]
[null,"2021-06-29","De Hambaken",13,"-",12,"W",3,1]
[null,"2021-07-06","De Hambaken",13,"-",5,"W",3,8]
[null,"2021-07-06","De Hambaken",3,"-",9,"V",0,-6]
[null,"2021-07-06","De Hambaken",12,"-",5,"W",3,7]
[null,null,null,null,"-",null,"-","-","-"]
[null,null,null,null,"-",null,"-","-","-"]
[null,null,null,null,"-",null,"-","-","-"]
[null,null,null,null,"-",null,"-","-","-"]
[null,null,null,null,"-",null,"-","-","-"]
[null,null,null,null,"-",null,"-","-","-"]
[null,null,null,null,"-",null,"-","-","-"]
[null,null,null,null,"-",null,"-","-","-"]
[null,null,null,null,"-",null,"-","-","-"]
[null,null,null,null,"-",null,"-","-","-"]
[null,null,null,null,"-",null,"-","-","-"]
[null,null,null,null,"-",null,"-","-","-"]
[null,null,null,null,"-",null,"-","-","-"]

{"sheet":"Els Kuijpers - Hermsen","index":29,"n_rows":56,"n_cols":9,"rows_kept":56,"cut":false,"hidden":false,"merged":[[27,1,27,8],[30,3,30,5],[20,1,20,4],[21,7,21,8],[21,1,21,4],[22,1,22,4],[23,1,23,4],[24,1,24,4],[18,7,20,8],[19,1,19,4],[12,1,12,8],[15,1,15,4],[16,1,16,4],[17,1,17,4],[18,1,18,4]]}
[]
[]
[]
[]
[]
[]
[]
[]
[]
[]
[]
[]
[null,"Els Kuijpers - Hermsen"]
[]
[]
[null,"Gespeeld",null,null,null,{"$f":"COUNTIF(G32:G57,\"W\")+COUNTIF(G32:G57,\"G\")+COUNTIF(G32:G57,\"V\")","v":3}]
[null,"Gewonnen",null,null,null,{"$f":"COUNTIF(G32:G57,\"W\")","v":1}]
[null,"Gelijk",null,null,null,{"$f":"COUNTIF(G32:G57,\"G\")","v":1}]
[null,"Verloren",null,null,null,{"$f":"COUNTIF(G32:G57,\"V\")","v":1},null,"Wijk van initiële inschrijving\n(met shirtkleur finaledag)"]
[null,"% gewonnen",null,null,null,{"$f":"IF(F16=0,0,F17/F16)","v":0.33333333333333331}]
[null,"% gelijk",null,null,null,{"$f":"IF(F16=0,0,F18/F16)","v":0.33333333333333331}]
[null,"% verloren",null,null,null,{"$f":"IF(F16=0,0,F19/F16)","v":0.33333333333333331},null,"De Schutskamp"]
[null,"Wedstrijdpunten",null,null,null,{"$f":"SUM(H32:H57)","v":5}]
[null,"Saldopunten",null,null,null,{"$f":"SUM(I32:I57)","v":1}]
[null,"Saldopunten per wedstrijd",null,null,null,{"$f":"IF(F16=0,0,F24/F16)","v":0.33333333333333331}]
[]
[]
[null,"LET OP: alleen wedstrijden die daadwerkelijk gespeeld zijn in de wijk waarvoor jij je hebt ingeschreven tellen mee!"]
[]
[]
[null,"Datum","Locatie","UITSLAGEN",null,null,"W, V of G?","Wedstrijd-punten","Saldo-punten"]
[null,"2021-06-24","De Schutskamp",5,"-",5,{"$f":"IF(OR($B$13=\"\",wijk_van_inschrijving=\"\"),\"-\",IF(OR(wijk_van_inschrijving<>C32,D32=\"\",F32=\"\"),\"-\",IF(D32>F32,\"W\",IF(D32=F32,\"G\",IF(D32<F32,\"V\",\"-\")))))","v":"G"},{"$f":"IF(OR($B$13=\"\",wijk_van_inschrijving=\"\"),\"-\",IF(OR(wijk_van_inschrijving<>C32,G32=\"-\",G32=\"\"),\"-\",IF(G32=\"W\",3,IF(G32=\"G\",2,IF(G32=\"V\",0,0)))))","v":2},{"$f":"IF(OR($B$13=\"\",wijk_van_inschrijving=\"\"),\"-\",IF(wijk_van_inschrijving<>C32,\"-\",IF(D32>=0,IF(F32=\"\",\"-\",D32-F32))))","v":0}]
[null,"2021-06-24","De Schutskamp",10,"-",5,"W",3,5]
[null,"2021-06-24","De Schutskamp",7,"-",11,"V",0,-4]
[null,null,null,null,"-",null,"-","-","-"]
[null,null,null,null,"-",null,"-","-","-"]
[null,null,null,null,"-",null,"-","-","-"]
[null,null,null,null,"-",null,"-","-","-"]
[null,null,null,null,"-",null,"-","-","-"]
[null,null,null,null,"-",null,"-","-","-"]
[null,null,null,null,"-",null,"-","-","-"]
[null,null,null,null,"-",null,"-","-","-"]
[null,null,null,null,"-",null,"-","-","-"]
[null,null,null,null,"-",null,"-","-","-"]
[null,null,null,null,"-",null,"-","-","-"]
[null,null,null,null,"-",null,"-","-","-"]
[null,null,null,null,"-",null,"-","-","-"]
[null,null,null,null,"-",null,"-","-","-"]
[null,null,null,null,"-",null,"-","-","-"]
[null,null,null,null,"-",null,"-","-","-"]
[null,null,null,null,"-",null,"-","-","-"]
[null,null,null,null,"-",null,"-","-","-"]
[null,null,null,null,"-",null,"-","-","-"]
[null,null,null,null,"-",null,"-","-","-"]
[null,null,null,null,"-",null,"-","-","-"]
[null,null,null,null,"-",null,"-","-","-"]

{"sheet":"Enn Tulkens","index":30,"n_rows":56,"n_cols":9,"rows_kept":56,"cut":false,"hidden":false,"merged":[[18,7,20,8],[30,3,30,5],[12,1,12,8],[15,1,15,4],[16,1,16,4],[17,1,17,4],[18,1,18,4],[19,1,19,4],[20,1,20,4],[21,1,21,4],[22,1,22,4],[23,1,23,4],[24,1,24,4],[21,7,21,8],[27,1,27,8]]}
[]
[]
[]
[]
[]
[]
[]
[]
[]
[]
[]
[]
[null,"Enn Tulkens"]
[]
[]
[null,"Gespeeld",null,null,null,{"$f":"COUNTIF(G32:G57,\"W\")+COUNTIF(G32:G57,\"G\")+COUNTIF(G32:G57,\"V\")","v":3}]
[null,"Gewonnen",null,null,null,{"$f":"COUNTIF(G32:G57,\"W\")","v":2}]
[null,"Gelijk",null,null,null,{"$f":"COUNTIF(G32:G57,\"G\")","v":0}]
[null,"Verloren",null,null,null,{"$f":"COUNTIF(G32:G57,\"V\")","v":1},null,"Wijk van initiële inschrijving\n(met shirtkleur finaledag)"]
[null,"% gewonnen",null,null,null,{"$f":"IF(F16=0,0,F17/F16)","v":0.66666666666666663}]
[null,"% gelijk",null,null,null,{"$f":"IF(F16=0,0,F18/F16)","v":0}]
[null,"% verloren",null,null,null,{"$f":"IF(F16=0,0,F19/F16)","v":0.33333333333333331},null,"'s-Hertogenbosch Zuid"]
[null,"Wedstrijdpunten",null,null,null,{"$f":"SUM(H32:H57)","v":6}]
[null,"Saldopunten",null,null,null,{"$f":"SUM(I32:I57)","v":2}]
[null,"Saldopunten per wedstrijd",null,null,null,{"$f":"IF(F16=0,0,F24/F16)","v":0.66666666666666663}]
[]
[]
[null,"LET OP: alleen wedstrijden die daadwerkelijk gespeeld zijn in de wijk waarvoor jij je hebt ingeschreven tellen mee!"]
[]
[]
[null,"Datum","Locatie","UITSLAGEN",null,null,"W, V of G?","Wedstrijd-punten","Saldo-punten"]
[null,"2021-06-15","Hondsberg (Rosmalen)",8,"-",5,{"$f":"IF(OR($B$13=\"\",wijk_van_inschrijving=\"\"),\"-\",IF(OR(wijk_van_inschrijving<>C32,D32=\"\",F32=\"\"),\"-\",IF(D32>F32,\"W\",IF(D32=F32,\"G\",IF(D32<F32,\"V\",\"-\")))))","v":"-"},{"$f":"IF(OR($B$13=\"\",wijk_van_inschrijving=\"\"),\"-\",IF(OR(wijk_van_inschrijving<>C32,G32=\"-\",G32=\"\"),\"-\",IF(G32=\"W\",3,IF(G32=\"G\",2,IF(G32=\"V\",0,0)))))","v":"-"},{"$f":"IF(OR($B$13=\"\",wijk_van_inschrijving=\"\"),\"-\",IF(wijk_van_inschrijving<>C32,\"-\",IF(D32>=0,IF(F32=\"\",\"-\",D32-F32))))","v":"-"}]
[null,"2021-06-15","Hondsberg (Rosmalen)",6,"-",6,"-","-","-"]
[null,"2021-06-15","Hondsberg (Rosmalen)",8,"-",8,"-","-","-"]
[null,"2021-06-18","'s-Hertogenbosch Zuid",1,"-",13,"V",0,-12]
[null,"2021-06-18","'s-Hertogenbosch Zuid",12,"-",1,"W",3,11]
[null,"2021-06-18","'s-Hertogenbosch Zuid",9,"-",6,"W",3,3]
[null,null,null,null,"-",null,"-","-","-"]
[null,null,null,null,"-",null,"-","-","-"]
[null,null,null,null,"-",null,"-","-","-"]
[null,null,null,null,"-",null,"-","-","-"]
[null,null,null,null,"-",null,"-","-","-"]
[null,null,null,null,"-",null,"-","-","-"]
[null,null,null,null,"-",null,"-","-","-"]
[null,null,null,null,"-",null,"-","-","-"]
[null,null,null,null,"-",null,"-","-","-"]
[null,null,null,null,"-",null,"-","-","-"]
[null,null,null,null,"-",null,"-","-","-"]
[null,null,null,null,"-",null,"-","-","-"]
[null,null,null,null,"-",null,"-","-","-"]
[null,null,null,null,"-",null,"-","-","-"]
[null,null,null,null,"-",null,"-","-","-"]
[null,null,null,null,"-",null,"-","-","-"]
[null,null,null,null,"-",null,"-","-","-"]
[null,null,null,null,"-",null,"-","-","-"]
[null,null,null,null,"-",null,"-","-","-"]

{"sheet":"Evy Pappot","index":31,"n_rows":56,"n_cols":9,"rows_kept":56,"cut":false,"hidden":false,"merged":[[18,7,20,8],[30,3,30,5],[12,1,12,8],[15,1,15,4],[16,1,16,4],[17,1,17,4],[18,1,18,4],[19,1,19,4],[20,1,20,4],[21,1,21,4],[22,1,22,4],[23,1,23,4],[24,1,24,4],[21,7,21,8],[27,1,27,8]]}
[]
[]
[]
[]
[]
[]
[]
[]
[]
[]
[]
[]
[null,"Evy Pappot"]
[]
[]
[null,"Gespeeld",null,null,null,{"$f":"COUNTIF(G32:G57,\"W\")+COUNTIF(G32:G57,\"G\")+COUNTIF(G32:G57,\"V\")","v":4}]
[null,"Gewonnen",null,null,null,{"$f":"COUNTIF(G32:G57,\"W\")","v":1}]
[null,"Gelijk",null,null,null,{"$f":"COUNTIF(G32:G57,\"G\")","v":0}]
[null,"Verloren",null,null,null,{"$f":"COUNTIF(G32:G57,\"V\")","v":3},null,"Wijk van initiële inschrijving\n(met shirtkleur finaledag)"]
[null,"% gewonnen",null,null,null,{"$f":"IF(F16=0,0,F17/F16)","v":0.25}]
[null,"% gelijk",null,null,null,{"$f":"IF(F16=0,0,F18/F16)","v":0}]
[null,"% verloren",null,null,null,{"$f":"IF(F16=0,0,F19/F16)","v":0.75},null,"De Hambaken"]
[null,"Wedstrijdpunten",null,null,null,{"$f":"SUM(H32:H57)","v":3}]
[null,"Saldopunten",null,null,null,{"$f":"SUM(I32:I57)","v":-16}]
[null,"Saldopunten per wedstrijd",null,null,null,{"$f":"IF(F16=0,0,F24/F16)","v":-4}]
[]
[]
[null,"LET OP: alleen wedstrijden die daadwerkelijk gespeeld zijn in de wijk waarvoor jij je hebt ingeschreven tellen mee!"]
[]
[]
[null,"Datum","Locatie","UITSLAGEN",null,null,"W, V of G?","Wedstrijd-punten","Saldo-punten"]
[null,"2021-06-16","De Hambaken",6,"-",7,{"$f":"IF(OR($B$13=\"\",wijk_van_inschrijving=\"\"),\"-\",IF(OR(wijk_van_inschrijving<>C32,D32=\"\",F32=\"\"),\"-\",IF(D32>F32,\"W\",IF(D32=F32,\"G\",IF(D32<F32,\"V\",\"-\")))))","v":"V"},{"$f":"IF(OR($B$13=\"\",wijk_van_inschrijving=\"\"),\"-\",IF(OR(wijk_van_inschrijving<>C32,G32=\"-\",G32=\"\"),\"-\",IF(G32=\"W\",3,IF(G32=\"G\",2,IF(G32=\"V\",0,0)))))","v":0},{"$f":"IF(OR($B$13=\"\",wijk_van_inschrijving=\"\"),\"-\",IF(wijk_van_inschrijving<>C32,\"-\",IF(D32>=0,IF(F32=\"\",\"-\",D32-F32))))","v":-1}]
[null,"2021-06-23","De Hambaken",0,"-",13,"V",0,-13]
[null,"2021-06-23","De Hambaken",9,"-",4,"W",3,5]
[null,"2021-06-23","De Hambaken",5,"-",12,"V",0,-7]
[null,null,null,null,"-",null,"-","-","-"]
[null,null,null,null,"-",null,"-","-","-"]
[null,null,null,null,"-",null,"-","-","-"]
[null,null,null,null,"-",null,"-","-","-"]
[null,null,null,null,"-",null,"-","-","-"]
[null,null,null,null,"-",null,"-","-","-"]
[null,null,null,null,"-",null,"-","-","-"]
[null,null,null,null,"-",null,"-","-","-"]
[null,null,null,null,"-",null,"-","-","-"]
[null,null,null,null,"-",null,"-","-","-"]
[null,null,null,null,"-",null,"-","-","-"]
[null,null,null,null,"-",null,"-","-","-"]
[null,null,null,null,"-",null,"-","-","-"]
[null,null,null,null,"-",null,"-","-","-"]
[null,null,null,null,"-",null,"-","-","-"]
[null,null,null,null,"-",null,"-","-","-"]
[null,null,null,null,"-",null,"-","-","-"]
[null,null,null,null,"-",null,"-","-","-"]
[null,null,null,null,"-",null,"-","-","-"]
[null,null,null,null,"-",null,"-","-","-"]
[null,null,null,null,"-",null,"-","-","-"]

{"sheet":"Fien Bertrums","index":32,"n_rows":56,"n_cols":9,"rows_kept":56,"cut":false,"hidden":false,"merged":[[19,1,19,4],[12,1,12,8],[15,1,15,4],[16,1,16,4],[17,1,17,4],[18,1,18,4],[18,7,20,8],[27,1,27,8],[30,3,30,5],[20,1,20,4],[21,7,21,8],[21,1,21,4],[22,1,22,4],[23,1,23,4],[24,1,24,4]]}
[]
[]
[]
[]
[]
[]
[]
[]
[]
[]
[]
[]
[null,"Fien Bertrums"]
[]
[]
[null,"Gespeeld",null,null,null,{"$f":"COUNTIF(G32:G57,\"W\")+COUNTIF(G32:G57,\"G\")+COUNTIF(G32:G57,\"V\")","v":6}]
[null,"Gewonnen",null,null,null,{"$f":"COUNTIF(G32:G57,\"W\")","v":0}]
[null,"Gelijk",null,null,null,{"$f":"COUNTIF(G32:G57,\"G\")","v":0}]
[null,"Verloren",null,null,null,{"$f":"COUNTIF(G32:G57,\"V\")","v":6},null,"Wijk van initiële inschrijving\n(met shirtkleur finaledag)"]
[null,"% gewonnen",null,null,null,{"$f":"IF(F16=0,0,F17/F16)","v":0}]
[null,"% gelijk",null,null,null,{"$f":"IF(F16=0,0,F18/F16)","v":0}]
[null,"% verloren",null,null,null,{"$f":"IF(F16=0,0,F19/F16)","v":1},null,"'s-Hertogenbosch Zuid"]
[null,"Wedstrijdpunten",null,null,null,{"$f":"SUM(H32:H57)","v":0}]
[null,"Saldopunten",null,null,null,{"$f":"SUM(I32:I57)","v":-39}]
[null,"Saldopunten per wedstrijd",null,null,null,{"$f":"IF(F16=0,0,F24/F16)","v":-6.5}]
[]
[]
[null,"LET OP: alleen wedstrijden die daadwerkelijk gespeeld zijn in de wijk waarvoor jij je hebt ingeschreven tellen mee!"]
[]
[]
[null,"Datum","Locatie","UITSLAGEN",null,null,"W, V of G?","Wedstrijd-punten","Saldo-punten"]
[null,"2021-07-01","'s-Hertogenbosch Zuid",4,"-",9,{"$f":"IF(OR($B$13=\"\",wijk_van_inschrijving=\"\"),\"-\",IF(OR(wijk_van_inschrijving<>C32,D32=\"\",F32=\"\"),\"-\",IF(D32>F32,\"W\",IF(D32=F32,\"G\",IF(D32<F32,\"V\",\"-\")))))","v":"V"},{"$f":"IF(OR($B$13=\"\",wijk_van_inschrijving=\"\"),\"-\",IF(OR(wijk_van_inschrijving<>C32,G32=\"-\",G32=\"\"),\"-\",IF(G32=\"W\",3,IF(G32=\"G\",2,IF(G32=\"V\",0,0)))))","v":0},{"$f":"IF(OR($B$13=\"\",wijk_van_inschrijving=\"\"),\"-\",IF(wijk_van_inschrijving<>C32,\"-\",IF(D32>=0,IF(F32=\"\",\"-\",D32-F32))))","v":-5}]
[null,"2021-07-01","'s-Hertogenbosch Zuid",6,"-",8,"V",0,-2]
[null,"2021-07-01","'s-Hertogenbosch Zuid",1,"-",13,"V",0,-12]
[null,"2021-07-08","'s-Hertogenbosch Zuid",2,"-",10,"V",0,-8]
[null,"2021-07-08","'s-Hertogenbosch Zuid",5,"-",11,"V",0,-6]
[null,"2021-07-08","'s-Hertogenbosch Zuid",7,"-",13,"V",0,-6]
[null,null,null,null,"-",null,"-","-","-"]
[null,null,null,null,"-",null,"-","-","-"]
[null,null,null,null,"-",null,"-","-","-"]
[null,null,null,null,"-",null,"-","-","-"]
[null,null,null,null,"-",null,"-","-","-"]
[null,null,null,null,"-",null,"-","-","-"]
[null,null,null,null,"-",null,"-","-","-"]
[null,null,null,null,"-",null,"-","-","-"]
[null,null,null,null,"-",null,"-","-","-"]
[null,null,null,null,"-",null,"-","-","-"]
[null,null,null,null,"-",null,"-","-","-"]
[null,null,null,null,"-",null,"-","-","-"]
[null,null,null,null,"-",null,"-","-","-"]
[null,null,null,null,"-",null,"-","-","-"]
[null,null,null,null,"-",null,"-","-","-"]
[null,null,null,null,"-",null,"-","-","-"]
[null,null,null,null,"-",null,"-","-","-"]
[null,null,null,null,"-",null,"-","-","-"]
[null,null,null,null,"-",null,"-","-","-"]

{"sheet":"Franka van Aerle","index":33,"n_rows":56,"n_cols":9,"rows_kept":56,"cut":false,"hidden":false,"merged":[[19,1,19,4],[12,1,12,8],[15,1,15,4],[16,1,16,4],[17,1,17,4],[18,1,18,4],[18,7,20,8],[27,1,27,8],[30,3,30,5],[20,1,20,4],[21,7,21,8],[21,1,21,4],[22,1,22,4],[23,1,23,4],[24,1,24,4]]}
[]
[]
[]
[]
[]
[]
[]
[]
[]
[]
[]
[]
[null,"Franka van Aerle"]
[]
[]
[null,"Gespeeld",null,null,null,{"$f":"COUNTIF(G32:G57,\"W\")+COUNTIF(G32:G57,\"G\")+COUNTIF(G32:G57,\"V\")","v":9}]
[null,"Gewonnen",null,null,null,{"$f":"COUNTIF(G32:G57,\"W\")","v":5}]
[null,"Gelijk",null,null,null,{"$f":"COUNTIF(G32:G57,\"G\")","v":0}]
[null,"Verloren",null,null,null,{"$f":"COUNTIF(G32:G57,\"V\")","v":4},null,"Wijk van initiële inschrijving\n(met shirtkleur finaledag)"]
[null,"% gewonnen",null,null,null,{"$f":"IF(F16=0,0,F17/F16)","v":0.55555555555555558}]
[null,"% gelijk",null,null,null,{"$f":"IF(F16=0,0,F18/F16)","v":0}]
[null,"% verloren",null,null,null,{"$f":"IF(F16=0,0,F19/F16)","v":0.44444444444444442},null,"De Hambaken"]
[null,"Wedstrijdpunten",null,null,null,{"$f":"SUM(H32:H57)","v":15}]
[null,"Saldopunten",null,null,null,{"$f":"SUM(I32:I57)","v":28}]
[null,"Saldopunten per wedstrijd",null,null,null,{"$f":"IF(F16=0,0,F24/F16)","v":3.1111111111111112}]
[]
[]
[null,"LET OP: alleen wedstrijden die daadwerkelijk gespeeld zijn in de wijk waarvoor jij je hebt ingeschreven tellen mee!"]
[]
[]
[null,"Datum","Locatie","UITSLAGEN",null,null,"W, V of G?","Wedstrijd-punten","Saldo-punten"]
[null,"2021-06-23","De Hambaken",13,"-",0,{"$f":"IF(OR($B$13=\"\",wijk_van_inschrijving=\"\"),\"-\",IF(OR(wijk_van_inschrijving<>C32,D32=\"\",F32=\"\"),\"-\",IF(D32>F32,\"W\",IF(D32=F32,\"G\",IF(D32<F32,\"V\",\"-\")))))","v":"W"},{"$f":"IF(OR($B$13=\"\",wijk_van_inschrijving=\"\"),\"-\",IF(OR(wijk_van_inschrijving<>C32,G32=\"-\",G32=\"\"),\"-\",IF(G32=\"W\",3,IF(G32=\"G\",2,IF(G32=\"V\",0,0)))))","v":3},{"$f":"IF(OR($B$13=\"\",wijk_van_inschrijving=\"\"),\"-\",IF(wijk_van_inschrijving<>C32,\"-\",IF(D32>=0,IF(F32=\"\",\"-\",D32-F32))))","v":13}]
[null,"2021-06-23","De Hambaken",9,"-",4,"W",3,5]
[null,"2021-06-23","De Hambaken",10,"-",13,"V",0,-3]
[null,"2021-06-29","De Hambaken",10,"-",4,"W",3,6]
[null,"2021-06-29","De Hambaken",13,"-",2,"W",3,11]
[null,"2021-06-29","De Hambaken",12,"-",13,"V",0,-1]
[null,"2021-07-06","De Hambaken",5,"-",13,"V",0,-8]
[null,"2021-07-06","De Hambaken",13,"-",5,"W",3,8]
[null,"2021-07-06","De Hambaken",6,"-",9,"V",0,-3]
[null,null,null,null,"-",null,"-","-","-"]
[null,null,null,null,"-",null,"-","-","-"]
[null,null,null,null,"-",null,"-","-","-"]
[null,null,null,null,"-",null,"-","-","-"]
[null,null,null,null,"-",null,"-","-","-"]
[null,null,null,null,"-",null,"-","-","-"]
[null,null,null,null,"-",null,"-","-","-"]
[null,null,null,null,"-",null,"-","-","-"]
[null,null,null,null,"-",null,"-","-","-"]
[null,null,null,null,"-",null,"-","-","-"]
[null,null,null,null,"-",null,"-","-","-"]
[null,null,null,null,"-",null,"-","-","-"]
[null,null,null,null,"-",null,"-","-","-"]
[null,null,null,null,"-",null,"-","-","-"]
[null,null,null,null,"-",null,"-","-","-"]
[null,null,null,null,"-",null,"-","-","-"]

{"sheet":"Frans Baert","index":34,"n_rows":56,"n_cols":9,"rows_kept":56,"cut":false,"hidden":false,"merged":[[27,1,27,8],[30,3,30,5],[20,1,20,4],[21,7,21,8],[21,1,21,4],[22,1,22,4],[23,1,23,4],[24,1,24,4],[18,7,20,8],[19,1,19,4],[12,1,12,8],[15,1,15,4],[16,1,16,4],[17,1,17,4],[18,1,18,4]]}
[]
[]
[]
[]
[]
[]
[]
[]
[]
[]
[]
[]
[null,"Frans Baert"]
[]
[]
[null,"Gespeeld",null,null,null,{"$f":"COUNTIF(G32:G57,\"W\")+COUNTIF(G32:G57,\"G\")+COUNTIF(G32:G57,\"V\")","v":9}]
[null,"Gewonnen",null,null,null,{"$f":"COUNTIF(G32:G57,\"W\")","v":6}]
[null,"Gelijk",null,null,null,{"$f":"COUNTIF(G32:G57,\"G\")","v":1}]
[null,"Verloren",null,null,null,{"$f":"COUNTIF(G32:G57,\"V\")","v":2},null,"Wijk van initiële inschrijving\n(met shirtkleur finaledag)"]
[null,"% gewonnen",null,null,null,{"$f":"IF(F16=0,0,F17/F16)","v":0.66666666666666663}]
[null,"% gelijk",null,null,null,{"$f":"IF(F16=0,0,F18/F16)","v":0.1111111111111111}]
[null,"% verloren",null,null,null,{"$f":"IF(F16=0,0,F19/F16)","v":0.22222222222222221},null,"'s-Hertogenbosch Zuid"]
[null,"Wedstrijdpunten",null,null,null,{"$f":"SUM(H32:H57)","v":20}]
[null,"Saldopunten",null,null,null,{"$f":"SUM(I32:I57)","v":36}]
[null,"Saldopunten per wedstrijd",null,null,null,{"$f":"IF(F16=0,0,F24/F16)","v":4}]
[]
[]
[null,"LET OP: alleen wedstrijden die daadwerkelijk gespeeld zijn in de wijk waarvoor jij je hebt ingeschreven tellen mee!"]
[]
[]
[null,"Datum","Locatie","UITSLAGEN",null,null,"W, V of G?","Wedstrijd-punten","Saldo-punten"]
[null,"2021-06-25","'s-Hertogenbosch Zuid",9,"-",9,{"$f":"IF(OR($B$13=\"\",wijk_van_inschrijving=\"\"),\"-\",IF(OR(wijk_van_inschrijving<>C32,D32=\"\",F32=\"\"),\"-\",IF(D32>F32,\"W\",IF(D32=F32,\"G\",IF(D32<F32,\"V\",\"-\")))))","v":"G"},{"$f":"IF(OR($B$13=\"\",wijk_van_inschrijving=\"\"),\"-\",IF(OR(wijk_van_inschrijving<>C32,G32=\"-\",G32=\"\"),\"-\",IF(G32=\"W\",3,IF(G32=\"G\",2,IF(G32=\"V\",0,0)))))","v":2},{"$f":"IF(OR($B$13=\"\",wijk_van_inschrijving=\"\"),\"-\",IF(wijk_van_inschrijving<>C32,\"-\",IF(D32>=0,IF(F32=\"\",\"-\",D32-F32))))","v":0}]
[null,"2021-06-25","'s-Hertogenbosch Zuid",13,"-",0,"W",3,13]
[null,"2021-06-25","'s-Hertogenbosch Zuid",9,"-",4,"W",3,5]
[null,"2021-07-01","'s-Hertogenbosch Zuid",13,"-",0,"W",3,13]
[null,"2021-07-01","'s-Hertogenbosch Zuid",5,"-",9,"V",0,-4]
[null,"2021-07-01","'s-Hertogenbosch Zuid",12,"-",8,"W",3,4]
[null,"2021-07-08","'s-Hertogenbosch Zuid",3,"-",11,"V",0,-8]
[null,"2021-07-08","'s-Hertogenbosch Zuid",10,"-",3,"W",3,7]
[null,"2021-07-08","'s-Hertogenbosch Zuid",13,"-",7,"W",3,6]
[null,null,null,null,"-",null,"-","-","-"]
[null,null,null,null,"-",null,"-","-","-"]
[null,null,null,null,"-",null,"-","-","-"]
[null,null,null,null,"-",null,"-","-","-"]
[null,null,null,null,"-",null,"-","-","-"]
[null,null,null,null,"-",null,"-","-","-"]
[null,null,null,null,"-",null,"-","-","-"]
[null,null,null,null,"-",null,"-","-","-"]
[null,null,null,null,"-",null,"-","-","-"]
[null,null,null,null,"-",null,"-","-","-"]
[null,null,null,null,"-",null,"-","-","-"]
[null,null,null,null,"-",null,"-","-","-"]
[null,null,null,null,"-",null,"-","-","-"]
[null,null,null,null,"-",null,"-","-","-"]
[null,null,null,null,"-",null,"-","-","-"]
[null,null,null,null,"-",null,"-","-","-"]

{"sheet":"Fred Eskens","index":35,"n_rows":56,"n_cols":9,"rows_kept":56,"cut":false,"hidden":false,"merged":[[27,1,27,8],[30,3,30,5],[20,1,20,4],[21,7,21,8],[21,1,21,4],[22,1,22,4],[23,1,23,4],[24,1,24,4],[18,7,20,8],[19,1,19,4],[12,1,12,8],[15,1,15,4],[16,1,16,4],[17,1,17,4],[18,1,18,4]]}
[]
[]
[]
[]
[]
[]
[]
[]
[]
[]
[]
[]
[null,"Fred Eskens"]
[]
[]
[null,"Gespeeld",null,null,null,{"$f":"COUNTIF(G32:G57,\"W\")+COUNTIF(G32:G57,\"G\")+COUNTIF(G32:G57,\"V\")","v":3}]
[null,"Gewonnen",null,null,null,{"$f":"COUNTIF(G32:G57,\"W\")","v":0}]
[null,"Gelijk",null,null,null,{"$f":"COUNTIF(G32:G57,\"G\")","v":1}]
[null,"Verloren",null,null,null,{"$f":"COUNTIF(G32:G57,\"V\")","v":2},null,"Wijk van initiële inschrijving\n(met shirtkleur finaledag)"]
[null,"% gewonnen",null,null,null,{"$f":"IF(F16=0,0,F17/F16)","v":0}]
[null,"% gelijk",null,null,null,{"$f":"IF(F16=0,0,F18/F16)","v":0.33333333333333331}]
[null,"% verloren",null,null,null,{"$f":"IF(F16=0,0,F19/F16)","v":0.66666666666666663},null,"De Schutskamp"]
[null,"Wedstrijdpunten",null,null,null,{"$f":"SUM(H32:H57)","v":2}]
[null,"Saldopunten",null,null,null,{"$f":"SUM(I32:I57)","v":-9}]
[null,"Saldopunten per wedstrijd",null,null,null,{"$f":"IF(F16=0,0,F24/F16)","v":-3}]
[]
[]
[null,"LET OP: alleen wedstrijden die daadwerkelijk gespeeld zijn in de wijk waarvoor jij je hebt ingeschreven tellen mee!"]
[]
[]
[null,"Datum","Locatie","UITSLAGEN",null,null,"W, V of G?","Wedstrijd-punten","Saldo-punten"]
[null,"2021-06-24","De Schutskamp",5,"-",5,{"$f":"IF(OR($B$13=\"\",wijk_van_inschrijving=\"\"),\"-\",IF(OR(wijk_van_inschrijving<>C32,D32=\"\",F32=\"\"),\"-\",IF(D32>F32,\"W\",IF(D32=F32,\"G\",IF(D32<F32,\"V\",\"-\")))))","v":"G"},{"$f":"IF(OR($B$13=\"\",wijk_van_inschrijving=\"\"),\"-\",IF(OR(wijk_van_inschrijving<>C32,G32=\"-\",G32=\"\"),\"-\",IF(G32=\"W\",3,IF(G32=\"G\",2,IF(G32=\"V\",0,0)))))","v":2},{"$f":"IF(OR($B$13=\"\",wijk_van_inschrijving=\"\"),\"-\",IF(wijk_van_inschrijving<>C32,\"-\",IF(D32>=0,IF(F32=\"\",\"-\",D32-F32))))","v":0}]
[null,"2021-06-24","De Schutskamp",5,"-",10,"V",0,-5]
[null,"2021-06-24","De Schutskamp",8,"-",12,"V",0,-4]
[null,null,null,null,"-",null,"-","-","-"]
[null,null,null,null,"-",null,"-","-","-"]
[null,null,null,null,"-",null,"-","-","-"]
[null,null,null,null,"-",null,"-","-","-"]
[null,null,null,null,"-",null,"-","-","-"]
[null,null,null,null,"-",null,"-","-","-"]
[null,null,null,null,"-",null,"-","-","-"]
[null,null,null,null,"-",null,"-","-","-"]
[null,null,null,null,"-",null,"-","-","-"]
[null,null,null,null,"-",null,"-","-","-"]
[null,null,null,null,"-",null,"-","-","-"]
[null,null,null,null,"-",null,"-","-","-"]
[null,null,null,null,"-",null,"-","-","-"]
[null,null,null,null,"-",null,"-","-","-"]
[null,null,null,null,"-",null,"-","-","-"]
[null,null,null,null,"-",null,"-","-","-"]
[null,null,null,null,"-",null,"-","-","-"]
[null,null,null,null,"-",null,"-","-","-"]
[null,null,null,null,"-",null,"-","-","-"]
[null,null,null,null,"-",null,"-","-","-"]
[null,null,null,null,"-",null,"-","-","-"]
[null,null,null,null,"-",null,"-","-","-"]

{"sheet":"Geert Hollander","index":36,"n_rows":56,"n_cols":9,"rows_kept":56,"cut":false,"hidden":false,"merged":[[18,7,20,8],[30,3,30,5],[12,1,12,8],[15,1,15,4],[16,1,16,4],[17,1,17,4],[18,1,18,4],[19,1,19,4],[20,1,20,4],[21,1,21,4],[22,1,22,4],[23,1,23,4],[24,1,24,4],[21,7,21,8],[27,1,27,8]]}
[]
[]
[]
[]
[]
[]
[]
[]
[]
[]
[]
[]
[null,"Geert Hollander"]
[]
[]
[null,"Gespeeld",null,null,null,{"$f":"COUNTIF(G32:G57,\"W\")+COUNTIF(G32:G57,\"G\")+COUNTIF(G32:G57,\"V\")","v":8}]
[null,"Gewonnen",null,null,null,{"$f":"COUNTIF(G32:G57,\"W\")","v":4}]
[null,"Gelijk",null,null,null,{"$f":"COUNTIF(G32:G57,\"G\")","v":1}]
[null,"Verloren",null,null,null,{"$f":"COUNTIF(G32:G57,\"V\")","v":3},null,"Wijk van initiële inschrijving\n(met shirtkleur finaledag)"]
[null,"% gewonnen",null,null,null,{"$f":"IF(F16=0,0,F17/F16)","v":0.5}]
[null,"% gelijk",null,null,null,{"$f":"IF(F16=0,0,F18/F16)","v":0.125}]
[null,"% verloren",null,null,null,{"$f":"IF(F16=0,0,F19/F16)","v":0.375},null,"'s-Hertogenbosch Zuid"]
[null,"Wedstrijdpunten",null,null,null,{"$f":"SUM(H32:H57)","v":14}]
[null,"Saldopunten",null,null,null,{"$f":"SUM(I32:I57)","v":11}]
[null,"Saldopunten per wedstrijd",null,null,null,{"$f":"IF(F16=0,0,F24/F16)","v":1.375}]
[]
[]
[null,"LET OP: alleen wedstrijden die daadwerkelijk gespeeld zijn in de wijk waarvoor jij je hebt ingeschreven tellen mee!"]
[]
[]
[null,"Datum","Locatie","UITSLAGEN",null,null,"W, V of G?","Wedstrijd-punten","Saldo-punten"]
[null,"2021-06-14","De Schutskamp",13,"-",2,{"$f":"IF(OR($B$13=\"\",wijk_van_inschrijving=\"\"),\"-\",IF(OR(wijk_van_inschrijving<>C32,D32=\"\",F32=\"\"),\"-\",IF(D32>F32,\"W\",IF(D32=F32,\"G\",IF(D32<F32,\"V\",\"-\")))))","v":"-"},{"$f":"IF(OR($B$13=\"\",wijk_van_inschrijving=\"\"),\"-\",IF(OR(wijk_van_inschrijving<>C32,G32=\"-\",G32=\"\"),\"-\",IF(G32=\"W\",3,IF(G32=\"G\",2,IF(G32=\"V\",0,0)))))","v":"-"},{"$f":"IF(OR($B$13=\"\",wijk_van_inschrijving=\"\"),\"-\",IF(wijk_van_inschrijving<>C32,\"-\",IF(D32>=0,IF(F32=\"\",\"-\",D32-F32))))","v":"-"}]
[null,"2021-06-14","De Schutskamp",4,"-",7,"-","-","-"]
[null,"2021-06-14","De Schutskamp",4,"-",9,"-","-","-"]
[null,"2021-06-25","'s-Hertogenbosch Zuid",9,"-",9,"G",2,0]
[null,"2021-06-25","'s-Hertogenbosch Zuid",8,"-",3,"W",3,5]
[null,"2021-07-01","'s-Hertogenbosch Zuid",4,"-",9,"V",0,-5]
[null,"2021-07-01","'s-Hertogenbosch Zuid",5,"-",13,"V",0,-8]
[null,"2021-07-01","'s-Hertogenbosch Zuid",13,"-",1,"W",3,12]
[null,"2021-07-08","'s-Hertogenbosch Zuid",13,"-",5,"W",3,8]
[null,"2021-07-08","'s-Hertogenbosch Zuid",3,"-",10,"V",0,-7]
[null,"2021-07-08","'s-Hertogenbosch Zuid",13,"-",7,"W",3,6]
[null,null,null,null,"-",null,"-","-","-"]
[null,null,null,null,"-",null,"-","-","-"]
[null,null,null,null,"-",null,"-","-","-"]
[null,null,null,null,"-",null,"-","-","-"]
[null,null,null,null,"-",null,"-","-","-"]
[null,null,null,null,"-",null,"-","-","-"]
[null,null,null,null,"-",null,"-","-","-"]
[null,null,null,null,"-",null,"-","-","-"]
[null,null,null,null,"-",null,"-","-","-"]
[null,null,null,null,"-",null,"-","-","-"]
[null,null,null,null,"-",null,"-","-","-"]
[null,null,null,null,"-",null,"-","-","-"]
[null,null,null,null,"-",null,"-","-","-"]
[null,null,null,null,"-",null,"-","-","-"]

{"sheet":"Gerard van der Loo","index":37,"n_rows":56,"n_cols":9,"rows_kept":56,"cut":false,"hidden":false,"merged":[[18,7,20,8],[30,3,30,5],[12,1,12,8],[15,1,15,4],[16,1,16,4],[17,1,17,4],[18,1,18,4],[19,1,19,4],[20,1,20,4],[21,1,21,4],[22,1,22,4],[23,1,23,4],[24,1,24,4],[21,7,21,8],[27,1,27,8]]}
[]
[]
[]
[]
[]
[]
[]
[]
[]
[]
[]
[]
[null,"Gerard van der Loo"]
[]
[]
[null,"Gespeeld",null,null,null,{"$f":"COUNTIF(G32:G57,\"W\")+COUNTIF(G32:G57,\"G\")+COUNTIF(G32:G57,\"V\")","v":12}]
[null,"Gewonnen",null,null,null,{"$f":"COUNTIF(G32:G57,\"W\")","v":10}]
[null,"Gelijk",null,null,null,{"$f":"COUNTIF(G32:G57,\"G\")","v":1}]
[null,"Verloren",null,null,null,{"$f":"COUNTIF(G32:G57,\"V\")","v":1},null,"Wijk van initiële inschrijving\n(met shirtkleur finaledag)"]
[null,"% gewonnen",null,null,null,{"$f":"IF(F16=0,0,F17/F16)","v":0.83333333333333337}]
[null,"% gelijk",null,null,null,{"$f":"IF(F16=0,0,F18/F16)","v":8.3333333333333329E-2}]
[null,"% verloren",null,null,null,{"$f":"IF(F16=0,0,F19/F16)","v":8.3333333333333329E-2},null,"De Schutskamp"]
[null,"Wedstrijdpunten",null,null,null,{"$f":"SUM(H32:H57)","v":32}]
[null,"Saldopunten",null,null,null,{"$f":"SUM(I32:I57)","v":83}]
[null,"Saldopunten per wedstrijd",null,null,null,{"$f":"IF(F16=0,0,F24/F16)","v":6.916666666666667}]
[]
[]
[null,"LET OP: alleen wedstrijden die daadwerkelijk gespeeld zijn in de wijk waarvoor jij je hebt ingeschreven tellen mee!"]
[]
[]
[null,"Datum","Locatie","UITSLAGEN",null,null,"W, V of G?","Wedstrijd-punten","Saldo-punten"]
[null,"2021-06-14","De Schutskamp",13,"-",0,{"$f":"IF(OR($B$13=\"\",wijk_van_inschrijving=\"\"),\"-\",IF(OR(wijk_van_inschrijving<>C32,D32=\"\",F32=\"\"),\"-\",IF(D32>F32,\"W\",IF(D32=F32,\"G\",IF(D32<F32,\"V\",\"-\")))))","v":"W"},{"$f":"IF(OR($B$13=\"\",wijk_van_inschrijving=\"\"),\"-\",IF(OR(wijk_van_inschrijving<>C32,G32=\"-\",G32=\"\"),\"-\",IF(G32=\"W\",3,IF(G32=\"G\",2,IF(G32=\"V\",0,0)))))","v":3},{"$f":"IF(OR($B$13=\"\",wijk_van_inschrijving=\"\"),\"-\",IF(wijk_van_inschrijving<>C32,\"-\",IF(D32>=0,IF(F32=\"\",\"-\",D32-F32))))","v":13}]
[null,"2021-06-14","De Schutskamp",8,"-",1,"W",3,7]
[null,"2021-06-14","De Schutskamp",13,"-",2,"W",3,11]
[null,"2021-06-24","De Schutskamp",8,"-",6,"W",3,2]
[null,"2021-06-24","De Schutskamp",13,"-",1,"W",3,12]
[null,"2021-06-24","De Schutskamp",11,"-",11,"G",2,0]
[null,"2021-06-28","De Schutskamp",13,"-",5,"W",3,8]
[null,"2021-06-28","De Schutskamp",13,"-",1,"W",3,12]
[null,"2021-06-28","De Schutskamp",13,"-",2,"W",3,11]
[null,"2021-07-05","De Schutskamp",7,"-",5,"W",3,2]
[null,"2021-07-05","De Schutskamp",9,"-",3,"W",3,6]
[null,"2021-07-05","De Schutskamp",5,"-",6,"V",0,-1]
[null,null,null,null,"-",null,"-","-","-"]
[null,null,null,null,"-",null,"-","-","-"]
[null,null,null,null,"-",null,"-","-","-"]
[null,null,null,null,"-",null,"-","-","-"]
[null,null,null,null,"-",null,"-","-","-"]
[null,null,null,null,"-",null,"-","-","-"]
[null,null,null,null,"-",null,"-","-","-"]
[null,null,null,null,"-",null,"-","-","-"]
[null,null,null,null,"-",null,"-","-","-"]
[null,null,null,null,"-",null,"-","-","-"]
[null,null,null,null,"-",null,"-","-","-"]
[null,null,null,null,"-",null,"-","-","-"]
[null,null,null,null,"-",null,"-","-","-"]

{"sheet":"Gert Hagemans","index":38,"n_rows":56,"n_cols":9,"rows_kept":56,"cut":false,"hidden":false,"merged":[[27,1,27,8],[30,3,30,5],[20,1,20,4],[21,7,21,8],[21,1,21,4],[22,1,22,4],[23,1,23,4],[24,1,24,4],[18,7,20,8],[19,1,19,4],[12,1,12,8],[15,1,15,4],[16,1,16,4],[17,1,17,4],[18,1,18,4]]}
[]
[]
[]
[]
[]
[]
[]
[]
[]
[]
[]
[]
[null,"Gert Hagemans"]
[]
[]
[null,"Gespeeld",null,null,null,{"$f":"COUNTIF(G32:G57,\"W\")+COUNTIF(G32:G57,\"G\")+COUNTIF(G32:G57,\"V\")","v":6}]
[null,"Gewonnen",null,null,null,{"$f":"COUNTIF(G32:G57,\"W\")","v":2}]
[null,"Gelijk",null,null,null,{"$f":"COUNTIF(G32:G57,\"G\")","v":0}]
[null,"Verloren",null,null,null,{"$f":"COUNTIF(G32:G57,\"V\")","v":4},null,"Wijk van initiële inschrijving\n(met shirtkleur finaledag)"]
[null,"% gewonnen",null,null,null,{"$f":"IF(F16=0,0,F17/F16)","v":0.33333333333333331}]
[null,"% gelijk",null,null,null,{"$f":"IF(F16=0,0,F18/F16)","v":0}]
[null,"% verloren",null,null,null,{"$f":"IF(F16=0,0,F19/F16)","v":0.66666666666666663},null,"Hondsberg (Rosmalen)"]
[null,"Wedstrijdpunten",null,null,null,{"$f":"SUM(H32:H57)","v":6}]
[null,"Saldopunten",null,null,null,{"$f":"SUM(I32:I57)","v":-9}]
[null,"Saldopunten per wedstrijd",null,null,null,{"$f":"IF(F16=0,0,F24/F16)","v":-1.5}]
[]
[]
[null,"LET OP: alleen wedstrijden die daadwerkelijk gespeeld zijn in de wijk waarvoor jij je hebt ingeschreven tellen mee!"]
[]
[]
[null,"Datum","Locatie","UITSLAGEN",null,null,"W, V of G?","Wedstrijd-punten","Saldo-punten"]
[null,"2021-06-30","Hondsberg (Rosmalen)",3,"-",6,{"$f":"IF(OR($B$13=\"\",wijk_van_inschrijving=\"\"),\"-\",IF(OR(wijk_van_inschrijving<>C32,D32=\"\",F32=\"\"),\"-\",IF(D32>F32,\"W\",IF(D32=F32,\"G\",IF(D32<F32,\"V\",\"-\")))))","v":"V"},{"$f":"IF(OR($B$13=\"\",wijk_van_inschrijving=\"\"),\"-\",IF(OR(wijk_van_inschrijving<>C32,G32=\"-\",G32=\"\"),\"-\",IF(G32=\"W\",3,IF(G32=\"G\",2,IF(G32=\"V\",0,0)))))","v":0},{"$f":"IF(OR($B$13=\"\",wijk_van_inschrijving=\"\"),\"-\",IF(wijk_van_inschrijving<>C32,\"-\",IF(D32>=0,IF(F32=\"\",\"-\",D32-F32))))","v":-3}]
[null,"2021-06-30","Hondsberg (Rosmalen)",2,"-",7,"V",0,-5]
[null,"2021-06-30","Hondsberg (Rosmalen)",13,"-",5,"W",3,8]
[null,"2021-07-07","Hondsberg (Rosmalen)",5,"-",12,"V",0,-7]
[null,"2021-07-07","Hondsberg (Rosmalen)",3,"-",11,"V",0,-8]
[null,"2021-07-07","Hondsberg (Rosmalen)",7,"-",1,"W",3,6]
[null,null,null,null,"-",null,"-","-","-"]
[null,null,null,null,"-",null,"-","-","-"]
[null,null,null,null,"-",null,"-","-","-"]
[null,null,null,null,"-",null,"-","-","-"]
[null,null,null,null,"-",null,"-","-","-"]
[null,null,null,null,"-",null,"-","-","-"]
[null,null,null,null,"-",null,"-","-","-"]
[null,null,null,null,"-",null,"-","-","-"]
[null,null,null,null,"-",null,"-","-","-"]
[null,null,null,null,"-",null,"-","-","-"]
[null,null,null,null,"-",null,"-","-","-"]
[null,null,null,null,"-",null,"-","-","-"]
[null,null,null,null,"-",null,"-","-","-"]
[null,null,null,null,"-",null,"-","-","-"]
[null,null,null,null,"-",null,"-","-","-"]
[null,null,null,null,"-",null,"-","-","-"]
[null,null,null,null,"-",null,"-","-","-"]
[null,null,null,null,"-",null,"-","-","-"]
[null,null,null,null,"-",null,"-","-","-"]

{"sheet":"Hans Fleuren","index":39,"n_rows":56,"n_cols":9,"rows_kept":56,"cut":false,"hidden":false,"merged":[[30,3,30,5],[21,1,21,4],[21,7,21,8],[22,1,22,4],[23,1,23,4],[24,1,24,4],[27,1,27,8],[12,1,12,8],[15,1,15,4],[16,1,16,4],[17,1,17,4],[18,1,18,4],[18,7,20,8],[19,1,19,4],[20,1,20,4]]}
[]
[]
[]
[]
[]
[]
[]
[]
[]
[]
[]
[]
[null,"Hans Fleuren"]
[]
[]
[null,"Gespeeld",null,null,null,{"$f":"COUNTIF(G32:G57,\"W\")+COUNTIF(G32:G57,\"G\")+COUNTIF(G32:G57,\"V\")","v":3}]
[null,"Gewonnen",null,null,null,{"$f":"COUNTIF(G32:G57,\"W\")","v":1}]
[null,"Gelijk",null,null,null,{"$f":"COUNTIF(G32:G57,\"G\")","v":0}]
[null,"Verloren",null,null,null,{"$f":"COUNTIF(G32:G57,\"V\")","v":2},null,"Wijk van initiële inschrijving\n(met shirtkleur finaledag)"]
[null,"% gewonnen",null,null,null,{"$f":"IF(F16=0,0,F17/F16)","v":0.33333333333333331}]
[null,"% gelijk",null,null,null,{"$f":"IF(F16=0,0,F18/F16)","v":0}]
[null,"% verloren",null,null,null,{"$f":"IF(F16=0,0,F19/F16)","v":0.66666666666666663},null,"Hondsberg (Rosmalen)"]
[null,"Wedstrijdpunten",null,null,null,{"$f":"SUM(H32:H57)","v":3}]
[null,"Saldopunten",null,null,null,{"$f":"SUM(I32:I57)","v":-14}]
[null,"Saldopunten per wedstrijd",null,null,null,{"$f":"IF(F16=0,0,F24/F16)","v":-4.666666666666667}]
[]
[]
[null,"LET OP: alleen wedstrijden die daadwerkelijk gespeeld zijn in de wijk waarvoor jij je hebt ingeschreven tellen mee!"]
[]
[]
[null,"Datum","Locatie","UITSLAGEN",null,null,"W, V of G?","Wedstrijd-punten","Saldo-punten"]
[null,"2021-06-14","De Schutskamp",8,"-",4,{"$f":"IF(OR($B$13=\"\",wijk_van_inschrijving=\"\"),\"-\",IF(OR(wijk_van_inschrijving<>C32,D32=\"\",F32=\"\"),\"-\",IF(D32>F32,\"W\",IF(D32=F32,\"G\",IF(D32<F32,\"V\",\"-\")))))","v":"-"},{"$f":"IF(OR($B$13=\"\",wijk_van_inschrijving=\"\"),\"-\",IF(OR(wijk_van_inschrijving<>C32,G32=\"-\",G32=\"\"),\"-\",IF(G32=\"W\",3,IF(G32=\"G\",2,IF(G32=\"V\",0,0)))))","v":"-"},{"$f":"IF(OR($B$13=\"\",wijk_van_inschrijving=\"\"),\"-\",IF(wijk_van_inschrijving<>C32,\"-\",IF(D32>=0,IF(F32=\"\",\"-\",D32-F32))))","v":"-"}]
[null,"2021-06-14","De Schutskamp",8,"-",5,"-","-","-"]
[null,"2021-07-07","Hondsberg (Rosmalen)",9,"-",6,"W",3,3]
[null,"2021-07-07","Hondsberg (Rosmalen)",2,"-",11,"V",0,-9]
[null,"2021-07-07","Hondsberg (Rosmalen)",3,"-",11,"V",0,-8]
[null,null,null,null,"-",null,"-","-","-"]
[null,null,null,null,"-",null,"-","-","-"]
[null,null,null,null,"-",null,"-","-","-"]
[null,null,null,null,"-",null,"-","-","-"]
[null,null,null,null,"-",null,"-","-","-"]
[null,null,null,null,"-",null,"-","-","-"]
[null,null,null,null,"-",null,"-","-","-"]
[null,null,null,null,"-",null,"-","-","-"]
[null,null,null,null,"-",null,"-","-","-"]
[null,null,null,null,"-",null,"-","-","-"]
[null,null,null,null,"-",null,"-","-","-"]
[null,null,null,null,"-",null,"-","-","-"]
[null,null,null,null,"-",null,"-","-","-"]
[null,null,null,null,"-",null,"-","-","-"]
[null,null,null,null,"-",null,"-","-","-"]
[null,null,null,null,"-",null,"-","-","-"]
[null,null,null,null,"-",null,"-","-","-"]
[null,null,null,null,"-",null,"-","-","-"]
[null,null,null,null,"-",null,"-","-","-"]
[null,null,null,null,"-",null,"-","-","-"]

{"sheet":"Hans van Woerkum","index":40,"n_rows":56,"n_cols":9,"rows_kept":56,"cut":false,"hidden":false,"merged":[[18,7,20,8],[30,3,30,5],[12,1,12,8],[15,1,15,4],[16,1,16,4],[17,1,17,4],[18,1,18,4],[19,1,19,4],[20,1,20,4],[21,1,21,4],[22,1,22,4],[23,1,23,4],[24,1,24,4],[21,7,21,8],[27,1,27,8]]}
[]
[]
[]
[]
[]
[]
[]
[]
[]
[]
[]
[]
[null,"Hans van Woerkum"]
[]
[]
[null,"Gespeeld",null,null,null,{"$f":"COUNTIF(G32:G57,\"W\")+COUNTIF(G32:G57,\"G\")+COUNTIF(G32:G57,\"V\")","v":12}]
[null,"Gewonnen",null,null,null,{"$f":"COUNTIF(G32:G57,\"W\")","v":9}]
[null,"Gelijk",null,null,null,{"$f":"COUNTIF(G32:G57,\"G\")","v":1}]
[null,"Verloren",null,null,null,{"$f":"COUNTIF(G32:G57,\"V\")","v":2},null,"Wijk van initiële inschrijving\n(met shirtkleur finaledag)"]
[null,"% gewonnen",null,null,null,{"$f":"IF(F16=0,0,F17/F16)","v":0.75}]
[null,"% gelijk",null,null,null,{"$f":"IF(F16=0,0,F18/F16)","v":8.3333333333333329E-2}]
[null,"% verloren",null,null,null,{"$f":"IF(F16=0,0,F19/F16)","v":0.16666666666666666},null,"De Schutskamp"]
[null,"Wedstrijdpunten",null,null,null,{"$f":"SUM(H32:H57)","v":29}]
[null,"Saldopunten",null,null,null,{"$f":"SUM(I32:I57)","v":68}]
[null,"Saldopunten per wedstrijd",null,null,null,{"$f":"IF(F16=0,0,F24/F16)","v":5.666666666666667}]
[]
[]
[null,"LET OP: alleen wedstrijden die daadwerkelijk gespeeld zijn in de wijk waarvoor jij je hebt ingeschreven tellen mee!"]
[]
[]
[null,"Datum","Locatie","UITSLAGEN",null,null,"W, V of G?","Wedstrijd-punten","Saldo-punten"]
[null,"2021-06-14","De Schutskamp",4,"-",8,{"$f":"IF(OR($B$13=\"\",wijk_van_inschrijving=\"\"),\"-\",IF(OR(wijk_van_inschrijving<>C32,D32=\"\",F32=\"\"),\"-\",IF(D32>F32,\"W\",IF(D32=F32,\"G\",IF(D32<F32,\"V\",\"-\")))))","v":"V"},{"$f":"IF(OR($B$13=\"\",wijk_van_inschrijving=\"\"),\"-\",IF(OR(wijk_van_inschrijving<>C32,G32=\"-\",G32=\"\"),\"-\",IF(G32=\"W\",3,IF(G32=\"G\",2,IF(G32=\"V\",0,0)))))","v":0},{"$f":"IF(OR($B$13=\"\",wijk_van_inschrijving=\"\"),\"-\",IF(wijk_van_inschrijving<>C32,\"-\",IF(D32>=0,IF(F32=\"\",\"-\",D32-F32))))","v":-4}]
[null,"2021-06-14","De Schutskamp",13,"-",0,"W",3,13]
[null,"2021-06-14","De Schutskamp",12,"-",7,"W",3,5]
[null,"2021-06-24","De Schutskamp",13,"-",8,"W",3,5]
[null,"2021-06-24","De Schutskamp",10,"-",5,"W",3,5]
[null,"2021-06-24","De Schutskamp",11,"-",11,"G",2,0]
[null,"2021-06-28","De Schutskamp",13,"-",3,"W",3,10]
[null,"2021-06-28","De Schutskamp",8,"-",7,"W",3,1]
[null,"2021-06-28","De Schutskamp",13,"-",2,"W",3,11]
[null,"2021-07-05","De Schutskamp",6,"-",8,"V",0,-2]
[null,"2021-07-05","De Schutskamp",13,"-",2,"W",3,11]
[null,"2021-07-05","De Schutskamp",13,"-",0,"W",3,13]
[null,null,null,null,"-",null,"-","-","-"]
[null,null,null,null,"-",null,"-","-","-"]
[null,null,null,null,"-",null,"-","-","-"]
[null,null,null,null,"-",null,"-","-","-"]
[null,null,null,null,"-",null,"-","-","-"]
[null,null,null,null,"-",null,"-","-","-"]
[null,null,null,null,"-",null,"-","-","-"]
[null,null,null,null,"-",null,"-","-","-"]
[null,null,null,null,"-",null,"-","-","-"]
[null,null,null,null,"-",null,"-","-","-"]
[null,null,null,null,"-",null,"-","-","-"]
[null,null,null,null,"-",null,"-","-","-"]
[null,null,null,null,"-",null,"-","-","-"]

{"sheet":"Harm Schilders","index":41,"n_rows":56,"n_cols":9,"rows_kept":56,"cut":false,"hidden":false,"merged":[[18,7,20,8],[30,3,30,5],[12,1,12,8],[15,1,15,4],[16,1,16,4],[17,1,17,4],[18,1,18,4],[19,1,19,4],[20,1,20,4],[21,1,21,4],[22,1,22,4],[23,1,23,4],[24,1,24,4],[21,7,21,8],[27,1,27,8]]}
[]
[]
[]
[]
[]
[]
[]
[]
[]
[]
[]
[]
[null,"Harm Schilders"]
[]
[]
[null,"Gespeeld",null,null,null,{"$f":"COUNTIF(G32:G57,\"W\")+COUNTIF(G32:G57,\"G\")+COUNTIF(G32:G57,\"V\")","v":5}]
[null,"Gewonnen",null,null,null,{"$f":"COUNTIF(G32:G57,\"W\")","v":4}]
[null,"Gelijk",null,null,null,{"$f":"COUNTIF(G32:G57,\"G\")","v":0}]
[null,"Verloren",null,null,null,{"$f":"COUNTIF(G32:G57,\"V\")","v":1},null,"Wijk van initiële inschrijving\n(met shirtkleur finaledag)"]
[null,"% gewonnen",null,null,null,{"$f":"IF(F16=0,0,F17/F16)","v":0.8}]
[null,"% gelijk",null,null,null,{"$f":"IF(F16=0,0,F18/F16)","v":0}]
[null,"% verloren",null,null,null,{"$f":"IF(F16=0,0,F19/F16)","v":0.2},null,"De Schutskamp"]
[null,"Wedstrijdpunten",null,null,null,{"$f":"SUM(H32:H57)","v":12}]
[null,"Saldopunten",null,null,null,{"$f":"SUM(I32:I57)","v":22}]
[null,"Saldopunten per wedstrijd",null,null,null,{"$f":"IF(F16=0,0,F24/F16)","v":4.4000000000000004}]
[]
[]
[null,"LET OP: alleen wedstrijden die daadwerkelijk gespeeld zijn in de wijk waarvoor jij je hebt ingeschreven tellen mee!"]
[]
[]
[null,"Datum","Locatie","UITSLAGEN",null,null,"W, V of G?","Wedstrijd-punten","Saldo-punten"]
[null,"2021-06-14","De Schutskamp",8,"-",4,{"$f":"IF(OR($B$13=\"\",wijk_van_inschrijving=\"\"),\"-\",IF(OR(wijk_van_inschrijving<>C32,D32=\"\",F32=\"\"),\"-\",IF(D32>F32,\"W\",IF(D32=F32,\"G\",IF(D32<F32,\"V\",\"-\")))))","v":"W"},{"$f":"IF(OR($B$13=\"\",wijk_van_inschrijving=\"\"),\"-\",IF(OR(wijk_van_inschrijving<>C32,G32=\"-\",G32=\"\"),\"-\",IF(G32=\"W\",3,IF(G32=\"G\",2,IF(G32=\"V\",0,0)))))","v":3},{"$f":"IF(OR($B$13=\"\",wijk_van_inschrijving=\"\"),\"-\",IF(wijk_van_inschrijving<>C32,\"-\",IF(D32>=0,IF(F32=\"\",\"-\",D32-F32))))","v":4}]
[null,"2021-06-14","De Schutskamp",8,"-",5,"W",3,3]
[null,"2021-06-23","De Hambaken",13,"-",0,"-","-","-"]
[null,"2021-06-23","De Hambaken",4,"-",9,"-","-","-"]
[null,"2021-06-23","De Hambaken",13,"-",10,"-","-","-"]
[null,"2021-06-28","De Schutskamp",12,"-",3,"W",3,9]
[null,"2021-06-28","De Schutskamp",13,"-",1,"W",3,12]
[null,"2021-06-28","De Schutskamp",6,"-",12,"V",0,-6]
[null,"2021-07-07","Hondsberg (Rosmalen)",9,"-",6,"-","-","-"]
[null,"2021-07-07","Hondsberg (Rosmalen)",11,"-",2,"-","-","-"]
[null,"2021-07-07","Hondsberg (Rosmalen)",6,"-",5,"-","-","-"]
[null,"2021-07-08","'s-Hertogenbosch Zuid",11,"-",3,"-","-","-"]
[null,"2021-07-08","'s-Hertogenbosch Zuid",3,"-",10,"-","-","-"]
[null,"2021-07-08","'s-Hertogenbosch Zuid",12,"-",8,"-","-","-"]
[null,null,null,null,"-",null,"-","-","-"]
[null,null,null,null,"-",null,"-","-","-"]
[null,null,null,null,"-",null,"-","-","-"]
[null,null,null,null,"-",null,"-","-","-"]
[null,null,null,null,"-",null,"-","-","-"]
[null,null,null,null,"-",null,"-","-","-"]
[null,null,null,null,"-",null,"-","-","-"]
[null,null,null,null,"-",null,"-","-","-"]
[null,null,null,null,"-",null,"-","-","-"]
[null,null,null,null,"-",null,"-","-","-"]
[null,null,null,null,"-",null,"-","-","-"]

{"sheet":"Henk Hermes","index":42,"n_rows":56,"n_cols":9,"rows_kept":56,"cut":false,"hidden":false,"merged":[[18,7,20,8],[30,3,30,5],[12,1,12,8],[15,1,15,4],[16,1,16,4],[17,1,17,4],[18,1,18,4],[19,1,19,4],[20,1,20,4],[21,1,21,4],[22,1,22,4],[23,1,23,4],[24,1,24,4],[21,7,21,8],[27,1,27,8]]}
[]
[]
[]
[]
[]
[]
[]
[]
[]
[]
[]
[]
[null,"Henk Hermes"]
[]
[]
[null,"Gespeeld",null,null,null,{"$f":"COUNTIF(G32:G57,\"W\")+COUNTIF(G32:G57,\"G\")+COUNTIF(G32:G57,\"V\")","v":12}]
[null,"Gewonnen",null,null,null,{"$f":"COUNTIF(G32:G57,\"W\")","v":11}]
[null,"Gelijk",null,null,null,{"$f":"COUNTIF(G32:G57,\"G\")","v":0}]
[null,"Verloren",null,null,null,{"$f":"COUNTIF(G32:G57,\"V\")","v":1},null,"Wijk van initiële inschrijving\n(met shirtkleur finaledag)"]
[null,"% gewonnen",null,null,null,{"$f":"IF(F16=0,0,F17/F16)","v":0.91666666666666663}]
[null,"% gelijk",null,null,null,{"$f":"IF(F16=0,0,F18/F16)","v":0}]
[null,"% verloren",null,null,null,{"$f":"IF(F16=0,0,F19/F16)","v":8.3333333333333329E-2},null,"'s-Hertogenbosch Zuid"]
[null,"Wedstrijdpunten",null,null,null,{"$f":"SUM(H32:H57)","v":33}]
[null,"Saldopunten",null,null,null,{"$f":"SUM(I32:I57)","v":70}]
[null,"Saldopunten per wedstrijd",null,null,null,{"$f":"IF(F16=0,0,F24/F16)","v":5.833333333333333}]
[]
[]
[null,"LET OP: alleen wedstrijden die daadwerkelijk gespeeld zijn in de wijk waarvoor jij je hebt ingeschreven tellen mee!"]
[]
[]
[null,"Datum","Locatie","UITSLAGEN",null,null,"W, V of G?","Wedstrijd-punten","Saldo-punten"]
[null,"2021-06-18","'s-Hertogenbosch Zuid",13,"-",1,{"$f":"IF(OR($B$13=\"\",wijk_van_inschrijving=\"\"),\"-\",IF(OR(wijk_van_inschrijving<>C32,D32=\"\",F32=\"\"),\"-\",IF(D32>F32,\"W\",IF(D32=F32,\"G\",IF(D32<F32,\"V\",\"-\")))))","v":"W"},{"$f":"IF(OR($B$13=\"\",wijk_van_inschrijving=\"\"),\"-\",IF(OR(wijk_van_inschrijving<>C32,G32=\"-\",G32=\"\"),\"-\",IF(G32=\"W\",3,IF(G32=\"G\",2,IF(G32=\"V\",0,0)))))","v":3},{"$f":"IF(OR($B$13=\"\",wijk_van_inschrijving=\"\"),\"-\",IF(wijk_van_inschrijving<>C32,\"-\",IF(D32>=0,IF(F32=\"\",\"-\",D32-F32))))","v":12}]
[null,"2021-06-18","'s-Hertogenbosch Zuid",12,"-",1,"W",3,11]
[null,"2021-06-18","'s-Hertogenbosch Zuid",11,"-",10,"W",3,1]
[null,"2021-06-25","'s-Hertogenbosch Zuid",13,"-",9,"W",3,4]
[null,"2021-06-25","'s-Hertogenbosch Zuid",8,"-",3,"W",3,5]
[null,"2021-06-25","'s-Hertogenbosch Zuid",13,"-",3,"W",3,10]
[null,"2021-07-01","'s-Hertogenbosch Zuid",13,"-",5,"W",3,8]
[null,"2021-07-01","'s-Hertogenbosch Zuid",13,"-",5,"W",3,8]
[null,"2021-07-01","'s-Hertogenbosch Zuid",8,"-",9,"V",0,-1]
[null,"2021-07-08","'s-Hertogenbosch Zuid",13,"-",3,"W",3,10]
[null,"2021-07-08","'s-Hertogenbosch Zuid",8,"-",7,"W",3,1]
[null,"2021-07-08","'s-Hertogenbosch Zuid",6,"-",5,"W",3,1]
[null,null,null,null,"-",null,"-","-","-"]
[null,null,null,null,"-",null,"-","-","-"]
[null,null,null,null,"-",null,"-","-","-"]
[null,null,null,null,"-",null,"-","-","-"]
[null,null,null,null,"-",null,"-","-","-"]
[null,null,null,null,"-",null,"-","-","-"]
[null,null,null,null,"-",null,"-","-","-"]
[null,null,null,null,"-",null,"-","-","-"]
[null,null,null,null,"-",null,"-","-","-"]
[null,null,null,null,"-",null,"-","-","-"]
[null,null,null,null,"-",null,"-","-","-"]
[null,null,null,null,"-",null,"-","-","-"]
[null,null,null,null,"-",null,"-","-","-"]

{"sheet":"Henk Kuijs","index":43,"n_rows":56,"n_cols":9,"rows_kept":56,"cut":false,"hidden":false,"merged":[[19,1,19,4],[12,1,12,8],[15,1,15,4],[16,1,16,4],[17,1,17,4],[18,1,18,4],[18,7,20,8],[27,1,27,8],[30,3,30,5],[20,1,20,4],[21,7,21,8],[21,1,21,4],[22,1,22,4],[23,1,23,4],[24,1,24,4]]}
[]
[]
[]
[]
[]
[]
[]
[]
[]
[]
[]
[]
[null,"Henk Kuijs"]
[]
[]
[null,"Gespeeld",null,null,null,{"$f":"COUNTIF(G32:G57,\"W\")+COUNTIF(G32:G57,\"G\")+COUNTIF(G32:G57,\"V\")","v":3}]
[null,"Gewonnen",null,null,null,{"$f":"COUNTIF(G32:G57,\"W\")","v":2}]
[null,"Gelijk",null,null,null,{"$f":"COUNTIF(G32:G57,\"G\")","v":0}]
[null,"Verloren",null,null,null,{"$f":"COUNTIF(G32:G57,\"V\")","v":1},null,"Wijk van initiële inschrijving\n(met shirtkleur finaledag)"]
[null,"% gewonnen",null,null,null,{"$f":"IF(F16=0,0,F17/F16)","v":0.66666666666666663}]
[null,"% gelijk",null,null,null,{"$f":"IF(F16=0,0,F18/F16)","v":0}]
[null,"% verloren",null,null,null,{"$f":"IF(F16=0,0,F19/F16)","v":0.33333333333333331},null,"'s-Hertogenbosch Zuid"]
[null,"Wedstrijdpunten",null,null,null,{"$f":"SUM(H32:H57)","v":6}]
[null,"Saldopunten",null,null,null,{"$f":"SUM(I32:I57)","v":4}]
[null,"Saldopunten per wedstrijd",null,null,null,{"$f":"IF(F16=0,0,F24/F16)","v":1.3333333333333333}]
[]
[]
[null,"LET OP: alleen wedstrijden die daadwerkelijk gespeeld zijn in de wijk waarvoor jij je hebt ingeschreven tellen mee!"]
[]
[]
[null,"Datum","Locatie","UITSLAGEN",null,null,"W, V of G?","Wedstrijd-punten","Saldo-punten"]
[null,"2021-07-01","'s-Hertogenbosch Zuid",7,"-",12,{"$f":"IF(OR($B$13=\"\",wijk_van_inschrijving=\"\"),\"-\",IF(OR(wijk_van_inschrijving<>C32,D32=\"\",F32=\"\"),\"-\",IF(D32>F32,\"W\",IF(D32=F32,\"G\",IF(D32<F32,\"V\",\"-\")))))","v":"V"},{"$f":"IF(OR($B$13=\"\",wijk_van_inschrijving=\"\"),\"-\",IF(OR(wijk_van_inschrijving<>C32,G32=\"-\",G32=\"\"),\"-\",IF(G32=\"W\",3,IF(G32=\"G\",2,IF(G32=\"V\",0,0)))))","v":0},{"$f":"IF(OR($B$13=\"\",wijk_van_inschrijving=\"\"),\"-\",IF(wijk_van_inschrijving<>C32,\"-\",IF(D32>=0,IF(F32=\"\",\"-\",D32-F32))))","v":-5}]
[null,"2021-07-01","'s-Hertogenbosch Zuid",9,"-",5,"W",3,4]
[null,"2021-07-01","'s-Hertogenbosch Zuid",13,"-",8,"W",3,5]
[null,null,null,null,"-",null,"-","-","-"]
[null,null,null,null,"-",null,"-","-","-"]
[null,null,null,null,"-",null,"-","-","-"]
[null,null,null,null,"-",null,"-","-","-"]
[null,null,null,null,"-",null,"-","-","-"]
[null,null,null,null,"-",null,"-","-","-"]
[null,null,null,null,"-",null,"-","-","-"]
[null,null,null,null,"-",null,"-","-","-"]
[null,null,null,null,"-",null,"-","-","-"]
[null,null,null,null,"-",null,"-","-","-"]
[null,null,null,null,"-",null,"-","-","-"]
[null,null,null,null,"-",null,"-","-","-"]
[null,null,null,null,"-",null,"-","-","-"]
[null,null,null,null,"-",null,"-","-","-"]
[null,null,null,null,"-",null,"-","-","-"]
[null,null,null,null,"-",null,"-","-","-"]
[null,null,null,null,"-",null,"-","-","-"]
[null,null,null,null,"-",null,"-","-","-"]
[null,null,null,null,"-",null,"-","-","-"]
[null,null,null,null,"-",null,"-","-","-"]
[null,null,null,null,"-",null,"-","-","-"]
[null,null,null,null,"-",null,"-","-","-"]

{"sheet":"Ilse van Mil","index":44,"n_rows":56,"n_cols":9,"rows_kept":56,"cut":false,"hidden":false,"merged":[[27,1,27,8],[30,3,30,5],[20,1,20,4],[21,7,21,8],[21,1,21,4],[22,1,22,4],[23,1,23,4],[24,1,24,4],[18,7,20,8],[19,1,19,4],[12,1,12,8],[15,1,15,4],[16,1,16,4],[17,1,17,4],[18,1,18,4]]}
[]
[]
[]
[]
[]
[]
[]
[]
[]
[]
[]
[]
[null,"Ilse van Mil"]
[]
[]
[null,"Gespeeld",null,null,null,{"$f":"COUNTIF(G32:G57,\"W\")+COUNTIF(G32:G57,\"G\")+COUNTIF(G32:G57,\"V\")","v":7}]
[null,"Gewonnen",null,null,null,{"$f":"COUNTIF(G32:G57,\"W\")","v":3}]
[null,"Gelijk",null,null,null,{"$f":"COUNTIF(G32:G57,\"G\")","v":0}]
[null,"Verloren",null,null,null,{"$f":"COUNTIF(G32:G57,\"V\")","v":4},null,"Wijk van initiële inschrijving\n(met shirtkleur finaledag)"]
[null,"% gewonnen",null,null,null,{"$f":"IF(F16=0,0,F17/F16)","v":0.42857142857142855}]
[null,"% gelijk",null,null,null,{"$f":"IF(F16=0,0,F18/F16)","v":0}]
[null,"% verloren",null,null,null,{"$f":"IF(F16=0,0,F19/F16)","v":0.5714285714285714},null,"Hondsberg (Rosmalen)"]
[null,"Wedstrijdpunten",null,null,null,{"$f":"SUM(H32:H57)","v":9}]
[null,"Saldopunten",null,null,null,{"$f":"SUM(I32:I57)","v":0}]
[null,"Saldopunten per wedstrijd",null,null,null,{"$f":"IF(F16=0,0,F24/F16)","v":0}]
[]
[]
[null,"LET OP: alleen wedstrijden die daadwerkelijk gespeeld zijn in de wijk waarvoor jij je hebt ingeschreven tellen mee!"]
[]
[]
[null,"Datum","Locatie","UITSLAGEN",null,null,"W, V of G?","Wedstrijd-punten","Saldo-punten"]
[null,"2021-06-22","Hondsberg (Rosmalen)",9,"-",2,{"$f":"IF(OR($B$13=\"\",wijk_van_inschrijving=\"\"),\"-\",IF(OR(wijk_van_inschrijving<>C32,D32=\"\",F32=\"\"),\"-\",IF(D32>F32,\"W\",IF(D32=F32,\"G\",IF(D32<F32,\"V\",\"-\")))))","v":"W"},{"$f":"IF(OR($B$13=\"\",wijk_van_inschrijving=\"\"),\"-\",IF(OR(wijk_van_inschrijving<>C32,G32=\"-\",G32=\"\"),\"-\",IF(G32=\"W\",3,IF(G32=\"G\",2,IF(G32=\"V\",0,0)))))","v":3},{"$f":"IF(OR($B$13=\"\",wijk_van_inschrijving=\"\"),\"-\",IF(wijk_van_inschrijving<>C32,\"-\",IF(D32>=0,IF(F32=\"\",\"-\",D32-F32))))","v":7}]
[null,"2021-06-22","Hondsberg (Rosmalen)",13,"-",6,"W",3,7]
[null,"2021-06-30","Hondsberg (Rosmalen)",5,"-",13,"V",0,-8]
[null,"2021-06-30","Hondsberg (Rosmalen)",6,"-",7,"V",0,-1]
[null,"2021-07-07","Hondsberg (Rosmalen)",6,"-",9,"V",0,-3]
[null,"2021-07-07","Hondsberg (Rosmalen)",10,"-",6,"W",3,4]
[null,"2021-07-07","Hondsberg (Rosmalen)",1,"-",7,"V",0,-6]
[null,null,null,null,"-",null,"-","-","-"]
[null,null,null,null,"-",null,"-","-","-"]
[null,null,null,null,"-",null,"-","-","-"]
[null,null,null,null,"-",null,"-","-","-"]
[null,null,null,null,"-",null,"-","-","-"]
[null,null,null,null,"-",null,"-","-","-"]
[null,null,null,null,"-",null,"-","-","-"]
[null,null,null,null,"-",null,"-","-","-"]
[null,null,null,null,"-",null,"-","-","-"]
[null,null,null,null,"-",null,"-","-","-"]
[null,null,null,null,"-",null,"-","-","-"]
[null,null,null,null,"-",null,"-","-","-"]
[null,null,null,null,"-",null,"-","-","-"]
[null,null,null,null,"-",null,"-","-","-"]
[null,null,null,null,"-",null,"-","-","-"]
[null,null,null,null,"-",null,"-","-","-"]
[null,null,null,null,"-",null,"-","-","-"]
[null,null,null,null,"-",null,"-","-","-"]

{"sheet":"Ineke Poort","index":45,"n_rows":56,"n_cols":9,"rows_kept":56,"cut":false,"hidden":false,"merged":[[18,7,20,8],[30,3,30,5],[12,1,12,8],[15,1,15,4],[16,1,16,4],[17,1,17,4],[18,1,18,4],[19,1,19,4],[20,1,20,4],[21,1,21,4],[22,1,22,4],[23,1,23,4],[24,1,24,4],[21,7,21,8],[27,1,27,8]]}
[]
[]
[]
[]
[]
[]
[]
[]
[]
[]
[]
[]
[null,"Ineke Poort"]
[]
[]
[null,"Gespeeld",null,null,null,{"$f":"COUNTIF(G32:G57,\"W\")+COUNTIF(G32:G57,\"G\")+COUNTIF(G32:G57,\"V\")","v":6}]
[null,"Gewonnen",null,null,null,{"$f":"COUNTIF(G32:G57,\"W\")","v":5}]
[null,"Gelijk",null,null,null,{"$f":"COUNTIF(G32:G57,\"G\")","v":0}]
[null,"Verloren",null,null,null,{"$f":"COUNTIF(G32:G57,\"V\")","v":1},null,"Wijk van initiële inschrijving\n(met shirtkleur finaledag)"]
[null,"% gewonnen",null,null,null,{"$f":"IF(F16=0,0,F17/F16)","v":0.83333333333333337}]
[null,"% gelijk",null,null,null,{"$f":"IF(F16=0,0,F18/F16)","v":0}]
[null,"% verloren",null,null,null,{"$f":"IF(F16=0,0,F19/F16)","v":0.16666666666666666},null,"'s-Hertogenbosch Zuid"]
[null,"Wedstrijdpunten",null,null,null,{"$f":"SUM(H32:H57)","v":15}]
[null,"Saldopunten",null,null,null,{"$f":"SUM(I32:I57)","v":41}]
[null,"Saldopunten per wedstrijd",null,null,null,{"$f":"IF(F16=0,0,F24/F16)","v":6.833333333333333}]
[]
[]
[null,"LET OP: alleen wedstrijden die daadwerkelijk gespeeld zijn in de wijk waarvoor jij je hebt ingeschreven tellen mee!"]
[]
[]
[null,"Datum","Locatie","UITSLAGEN",null,null,"W, V of G?","Wedstrijd-punten","Saldo-punten"]
[null,"2021-06-14","De Schutskamp",13,"-",2,{"$f":"IF(OR($B$13=\"\",wijk_van_inschrijving=\"\"),\"-\",IF(OR(wijk_van_inschrijving<>C32,D32=\"\",F32=\"\"),\"-\",IF(D32>F32,\"W\",IF(D32=F32,\"G\",IF(D32<F32,\"V\",\"-\")))))","v":"-"},{"$f":"IF(OR($B$13=\"\",wijk_van_inschrijving=\"\"),\"-\",IF(OR(wijk_van_inschrijving<>C32,G32=\"-\",G32=\"\"),\"-\",IF(G32=\"W\",3,IF(G32=\"G\",2,IF(G32=\"V\",0,0)))))","v":"-"},{"$f":"IF(OR($B$13=\"\",wijk_van_inschrijving=\"\"),\"-\",IF(wijk_van_inschrijving<>C32,\"-\",IF(D32>=0,IF(F32=\"\",\"-\",D32-F32))))","v":"-"}]
[null,"2021-06-14","De Schutskamp",5,"-",8,"-","-","-"]
[null,"2021-06-14","De Schutskamp",7,"-",12,"-","-","-"]
[null,"2021-06-25","'s-Hertogenbosch Zuid",9,"-",13,"V",0,-4]
[null,"2021-06-25","'s-Hertogenbosch Zuid",13,"-",0,"W",3,13]
[null,"2021-06-25","'s-Hertogenbosch Zuid",9,"-",4,"W",3,5]
[null,"2021-07-01","'s-Hertogenbosch Zuid",9,"-",4,"W",3,5]
[null,"2021-07-01","'s-Hertogenbosch Zuid",13,"-",4,"W",3,9]
[null,"2021-07-01","'s-Hertogenbosch Zuid",13,"-",0,"W",3,13]
[null,null,null,null,"-",null,"-","-","-"]
[null,null,null,null,"-",null,"-","-","-"]
[null,null,null,null,"-",null,"-","-","-"]
[null,null,null,null,"-",null,"-","-","-"]
[null,null,null,null,"-",null,"-","-","-"]
[null,null,null,null,"-",null,"-","-","-"]
[null,null,null,null,"-",null,"-","-","-"]
[null,null,null,null,"-",null,"-","-","-"]
[null,null,null,null,"-",null,"-","-","-"]
[null,null,null,null,"-",null,"-","-","-"]
[null,null,null,null,"-",null,"-","-","-"]
[null,null,null,null,"-",null,"-","-","-"]
[null,null,null,null,"-",null,"-","-","-"]
[null,null,null,null,"-",null,"-","-","-"]
[null,null,null,null,"-",null,"-","-","-"]
[null,null,null,null,"-",null,"-","-","-"]

{"sheet":"Iris Vriend","index":46,"n_rows":56,"n_cols":9,"rows_kept":56,"cut":false,"hidden":false,"merged":[[18,7,20,8],[30,3,30,5],[12,1,12,8],[15,1,15,4],[16,1,16,4],[17,1,17,4],[18,1,18,4],[19,1,19,4],[20,1,20,4],[21,1,21,4],[22,1,22,4],[23,1,23,4],[24,1,24,4],[21,7,21,8],[27,1,27,8]]}
[]
[]
[]
[]
[]
[]
[]
[]
[]
[]
[]
[]
[null,"Iris Vriend"]
[]
[]
[null,"Gespeeld",null,null,null,{"$f":"COUNTIF(G32:G57,\"W\")+COUNTIF(G32:G57,\"G\")+COUNTIF(G32:G57,\"V\")","v":10}]
[null,"Gewonnen",null,null,null,{"$f":"COUNTIF(G32:G57,\"W\")","v":0}]
[null,"Gelijk",null,null,null,{"$f":"COUNTIF(G32:G57,\"G\")","v":0}]
[null,"Verloren",null,null,null,{"$f":"COUNTIF(G32:G57,\"V\")","v":10},null,"Wijk van initiële inschrijving\n(met shirtkleur finaledag)"]
[null,"% gewonnen",null,null,null,{"$f":"IF(F16=0,0,F17/F16)","v":0}]
[null,"% gelijk",null,null,null,{"$f":"IF(F16=0,0,F18/F16)","v":0}]
[null,"% verloren",null,null,null,{"$f":"IF(F16=0,0,F19/F16)","v":1},null,"'s-Hertogenbosch Zuid"]
[null,"Wedstrijdpunten",null,null,null,{"$f":"SUM(H32:H57)","v":0}]
[null,"Saldopunten",null,null,null,{"$f":"SUM(I32:I57)","v":-64}]
[null,"Saldopunten per wedstrijd",null,null,null,{"$f":"IF(F16=0,0,F24/F16)","v":-6.4}]
[]
[]
[null,"LET OP: alleen wedstrijden die daadwerkelijk gespeeld zijn in de wijk waarvoor jij je hebt ingeschreven tellen mee!"]
[]
[]
[null,"Datum","Locatie","UITSLAGEN",null,null,"W, V of G?","Wedstrijd-punten","Saldo-punten"]
[null,"2021-06-18","'s-Hertogenbosch Zuid",2,"-",13,{"$f":"IF(OR($B$13=\"\",wijk_van_inschrijving=\"\"),\"-\",IF(OR(wijk_van_inschrijving<>C32,D32=\"\",F32=\"\"),\"-\",IF(D32>F32,\"W\",IF(D32=F32,\"G\",IF(D32<F32,\"V\",\"-\")))))","v":"V"},{"$f":"IF(OR($B$13=\"\",wijk_van_inschrijving=\"\"),\"-\",IF(OR(wijk_van_inschrijving<>C32,G32=\"-\",G32=\"\"),\"-\",IF(G32=\"W\",3,IF(G32=\"G\",2,IF(G32=\"V\",0,0)))))","v":0},{"$f":"IF(OR($B$13=\"\",wijk_van_inschrijving=\"\"),\"-\",IF(wijk_van_inschrijving<>C32,\"-\",IF(D32>=0,IF(F32=\"\",\"-\",D32-F32))))","v":-11}]
[null,"2021-06-18","'s-Hertogenbosch Zuid",2,"-",6,"V",0,-4]
[null,"2021-06-18","'s-Hertogenbosch Zuid",10,"-",11,"V",0,-1]
[null,"2021-06-25","'s-Hertogenbosch Zuid",4,"-",13,"V",0,-9]
[null,"2021-06-25","'s-Hertogenbosch Zuid",3,"-",8,"V",0,-5]
[null,"2021-06-25","'s-Hertogenbosch Zuid",4,"-",9,"V",0,-5]
[null,"2021-07-01","'s-Hertogenbosch Zuid",7,"-",12,"V",0,-5]
[null,"2021-07-01","'s-Hertogenbosch Zuid",4,"-",13,"V",0,-9]
[null,"2021-07-01","'s-Hertogenbosch Zuid",8,"-",13,"V",0,-5]
[null,"2021-07-08","'s-Hertogenbosch Zuid",3,"-",13,"V",0,-10]
[null,null,null,null,"-",null,"-","-","-"]
[null,null,null,null,"-",null,"-","-","-"]
[null,null,null,null,"-",null,"-","-","-"]
[null,null,null,null,"-",null,"-","-","-"]
[null,null,null,null,"-",null,"-","-","-"]
[null,null,null,null,"-",null,"-","-","-"]
[null,null,null,null,"-",null,"-","-","-"]
[null,null,null,null,"-",null,"-","-","-"]
[null,null,null,null,"-",null,"-","-","-"]
[null,null,null,null,"-",null,"-","-","-"]
[null,null,null,null,"-",null,"-","-","-"]
[null,null,null,null,"-",null,"-","-","-"]
[null,null,null,null,"-",null,"-","-","-"]
[null,null,null,null,"-",null,"-","-","-"]
[null,null,null,null,"-",null,"-","-","-"]

{"sheet":"Jaap Faber","index":47,"n_rows":56,"n_cols":9,"rows_kept":56,"cut":false,"hidden":false,"merged":[[18,7,20,8],[30,3,30,5],[12,1,12,8],[15,1,15,4],[16,1,16,4],[17,1,17,4],[18,1,18,4],[19,1,19,4],[20,1,20,4],[21,1,21,4],[22,1,22,4],[23,1,23,4],[24,1,24,4],[21,7,21,8],[27,1,27,8]]}
[]
[]
[]
[]
[]
[]
[]
[]
[]
[]
[]
[]
[null,"Jaap Faber"]
[]
[]
[null,"Gespeeld",null,null,null,{"$f":"COUNTIF(G32:G57,\"W\")+COUNTIF(G32:G57,\"G\")+COUNTIF(G32:G57,\"V\")","v":12}]
[null,"Gewonnen",null,null,null,{"$f":"COUNTIF(G32:G57,\"W\")","v":2}]
[null,"Gelijk",null,null,null,{"$f":"COUNTIF(G32:G57,\"G\")","v":1}]
[null,"Verloren",null,null,null,{"$f":"COUNTIF(G32:G57,\"V\")","v":9},null,"Wijk van initiële inschrijving\n(met shirtkleur finaledag)"]
[null,"% gewonnen",null,null,null,{"$f":"IF(F16=0,0,F17/F16)","v":0.16666666666666666}]
[null,"% gelijk",null,null,null,{"$f":"IF(F16=0,0,F18/F16)","v":8.3333333333333329E-2}]
[null,"% verloren",null,null,null,{"$f":"IF(F16=0,0,F19/F16)","v":0.75},null,"'s-Hertogenbosch Zuid"]
[null,"Wedstrijdpunten",null,null,null,{"$f":"SUM(H32:H57)","v":8}]
[null,"Saldopunten",null,null,null,{"$f":"SUM(I32:I57)","v":-80}]
[null,"Saldopunten per wedstrijd",null,null,null,{"$f":"IF(F16=0,0,F24/F16)","v":-6.666666666666667}]
[]
[]
[null,"LET OP: alleen wedstrijden die daadwerkelijk gespeeld zijn in de wijk waarvoor jij je hebt ingeschreven tellen mee!"]
[]
[]
[null,"Datum","Locatie","UITSLAGEN",null,null,"W, V of G?","Wedstrijd-punten","Saldo-punten"]
[null,"2021-06-18","'s-Hertogenbosch Zuid",1,"-",13,{"$f":"IF(OR($B$13=\"\",wijk_van_inschrijving=\"\"),\"-\",IF(OR(wijk_van_inschrijving<>C32,D32=\"\",F32=\"\"),\"-\",IF(D32>F32,\"W\",IF(D32=F32,\"G\",IF(D32<F32,\"V\",\"-\")))))","v":"V"},{"$f":"IF(OR($B$13=\"\",wijk_van_inschrijving=\"\"),\"-\",IF(OR(wijk_van_inschrijving<>C32,G32=\"-\",G32=\"\"),\"-\",IF(G32=\"W\",3,IF(G32=\"G\",2,IF(G32=\"V\",0,0)))))","v":0},{"$f":"IF(OR($B$13=\"\",wijk_van_inschrijving=\"\"),\"-\",IF(wijk_van_inschrijving<>C32,\"-\",IF(D32>=0,IF(F32=\"\",\"-\",D32-F32))))","v":-12}]
[null,"2021-06-18","'s-Hertogenbosch Zuid",6,"-",2,"W",3,4]
[null,"2021-06-18","'s-Hertogenbosch Zuid",1,"-",13,"V",0,-12]
[null,"2021-06-25","'s-Hertogenbosch Zuid",4,"-",13,"V",0,-9]
[null,"2021-06-25","'s-Hertogenbosch Zuid",0,"-",13,"V",0,-13]
[null,"2021-06-25","'s-Hertogenbosch Zuid",5,"-",12,"V",0,-7]
[null,"2021-07-01","'s-Hertogenbosch Zuid",7,"-",7,"G",2,0]
[null,"2021-07-01","'s-Hertogenbosch Zuid",8,"-",6,"W",3,2]
[null,"2021-07-01","'s-Hertogenbosch Zuid",0,"-",13,"V",0,-13]
[null,"2021-07-08","'s-Hertogenbosch Zuid",5,"-",13,"V",0,-8]
[null,"2021-07-08","'s-Hertogenbosch Zuid",7,"-",8,"V",0,-1]
[null,"2021-07-08","'s-Hertogenbosch Zuid",1,"-",12,"V",0,-11]
[null,null,null,null,"-",null,"-","-","-"]
[null,null,null,null,"-",null,"-","-","-"]
[null,null,null,null,"-",null,"-","-","-"]
[null,null,null,null,"-",null,"-","-","-"]
[null,null,null,null,"-",null,"-","-","-"]
[null,null,null,null,"-",null,"-","-","-"]
[null,null,null,null,"-",null,"-","-","-"]
[null,null,null,null,"-",null,"-","-","-"]
[null,null,null,null,"-",null,"-","-","-"]
[null,null,null,null,"-",null,"-","-","-"]
[null,null,null,null,"-",null,"-","-","-"]
[null,null,null,null,"-",null,"-","-","-"]
[null,null,null,null,"-",null,"-","-","-"]

{"sheet":"Jacques Tulkens","index":48,"n_rows":56,"n_cols":9,"rows_kept":56,"cut":false,"hidden":false,"merged":[[18,7,20,8],[30,3,30,5],[12,1,12,8],[15,1,15,4],[16,1,16,4],[17,1,17,4],[18,1,18,4],[19,1,19,4],[20,1,20,4],[21,1,21,4],[22,1,22,4],[23,1,23,4],[24,1,24,4],[21,7,21,8],[27,1,27,8]]}
[]
[]
[]
[]
[]
[]
[]
[]
[]
[]
[]
[]
[null,"Jacques Tulkens"]
[]
[]
[null,"Gespeeld",null,null,null,{"$f":"COUNTIF(G32:G57,\"W\")+COUNTIF(G32:G57,\"G\")+COUNTIF(G32:G57,\"V\")","v":3}]
[null,"Gewonnen",null,null,null,{"$f":"COUNTIF(G32:G57,\"W\")","v":0}]
[null,"Gelijk",null,null,null,{"$f":"COUNTIF(G32:G57,\"G\")","v":1}]
[null,"Verloren",null,null,null,{"$f":"COUNTIF(G32:G57,\"V\")","v":2},null,"Wijk van initiële inschrijving\n(met shirtkleur finaledag)"]
[null,"% gewonnen",null,null,null,{"$f":"IF(F16=0,0,F17/F16)","v":0}]
[null,"% gelijk",null,null,null,{"$f":"IF(F16=0,0,F18/F16)","v":0.33333333333333331}]
[null,"% verloren",null,null,null,{"$f":"IF(F16=0,0,F19/F16)","v":0.66666666666666663},null,"'s-Hertogenbosch Zuid"]
[null,"Wedstrijdpunten",null,null,null,{"$f":"SUM(H32:H57)","v":2}]
[null,"Saldopunten",null,null,null,{"$f":"SUM(I32:I57)","v":-15}]
[null,"Saldopunten per wedstrijd",null,null,null,{"$f":"IF(F16=0,0,F24/F16)","v":-5}]
[]
[]
[null,"LET OP: alleen wedstrijden die daadwerkelijk gespeeld zijn in de wijk waarvoor jij je hebt ingeschreven tellen mee!"]
[]
[]
[null,"Datum","Locatie","UITSLAGEN",null,null,"W, V of G?","Wedstrijd-punten","Saldo-punten"]
[null,"2021-06-15","Hondsberg (Rosmalen)",12,"-",2,{"$f":"IF(OR($B$13=\"\",wijk_van_inschrijving=\"\"),\"-\",IF(OR(wijk_van_inschrijving<>C32,D32=\"\",F32=\"\"),\"-\",IF(D32>F32,\"W\",IF(D32=F32,\"G\",IF(D32<F32,\"V\",\"-\")))))","v":"-"},{"$f":"IF(OR($B$13=\"\",wijk_van_inschrijving=\"\"),\"-\",IF(OR(wijk_van_inschrijving<>C32,G32=\"-\",G32=\"\"),\"-\",IF(G32=\"W\",3,IF(G32=\"G\",2,IF(G32=\"V\",0,0)))))","v":"-"},{"$f":"IF(OR($B$13=\"\",wijk_van_inschrijving=\"\"),\"-\",IF(wijk_van_inschrijving<>C32,\"-\",IF(D32>=0,IF(F32=\"\",\"-\",D32-F32))))","v":"-"}]
[null,"2021-06-15","Hondsberg (Rosmalen)",8,"-",6,"-","-","-"]
[null,"2021-06-15","Hondsberg (Rosmalen)",5,"-",13,"-","-","-"]
[null,"2021-06-18","'s-Hertogenbosch Zuid",1,"-",13,"V",0,-12]
[null,"2021-06-18","'s-Hertogenbosch Zuid",4,"-",4,"G",2,0]
[null,"2021-06-18","'s-Hertogenbosch Zuid",6,"-",9,"V",0,-3]
[null,null,null,null,"-",null,"-","-","-"]
[null,null,null,null,"-",null,"-","-","-"]
[null,null,null,null,"-",null,"-","-","-"]
[null,null,null,null,"-",null,"-","-","-"]
[null,null,null,null,"-",null,"-","-","-"]
[null,null,null,null,"-",null,"-","-","-"]
[null,null,null,null,"-",null,"-","-","-"]
[null,null,null,null,"-",null,"-","-","-"]
[null,null,null,null,"-",null,"-","-","-"]
[null,null,null,null,"-",null,"-","-","-"]
[null,null,null,null,"-",null,"-","-","-"]
[null,null,null,null,"-",null,"-","-","-"]
[null,null,null,null,"-",null,"-","-","-"]
[null,null,null,null,"-",null,"-","-","-"]
[null,null,null,null,"-",null,"-","-","-"]
[null,null,null,null,"-",null,"-","-","-"]
[null,null,null,null,"-",null,"-","-","-"]
[null,null,null,null,"-",null,"-","-","-"]
[null,null,null,null,"-",null,"-","-","-"]

{"sheet":"Jan Rovers","index":49,"n_rows":56,"n_cols":9,"rows_kept":56,"cut":false,"hidden":false,"merged":[[19,1,19,4],[12,1,12,8],[15,1,15,4],[16,1,16,4],[17,1,17,4],[18,1,18,4],[18,7,20,8],[27,1,27,8],[30,3,30,5],[20,1,20,4],[21,7,21,8],[21,1,21,4],[22,1,22,4],[23,1,23,4],[24,1,24,4]]}
[]
[]
[]
[]
[]
[]
[]
[]
[]
[]
[]
[]
[null,"Jan Rovers"]
[]
[]
[null,"Gespeeld",null,null,null,{"$f":"COUNTIF(G32:G57,\"W\")+COUNTIF(G32:G57,\"G\")+COUNTIF(G32:G57,\"V\")","v":9}]
[null,"Gewonnen",null,null,null,{"$f":"COUNTIF(G32:G57,\"W\")","v":3}]
[null,"Gelijk",null,null,null,{"$f":"COUNTIF(G32:G57,\"G\")","v":0}]
[null,"Verloren",null,null,null,{"$f":"COUNTIF(G32:G57,\"V\")","v":6},null,"Wijk van initiële inschrijving\n(met shirtkleur finaledag)"]
[null,"% gewonnen",null,null,null,{"$f":"IF(F16=0,0,F17/F16)","v":0.33333333333333331}]
[null,"% gelijk",null,null,null,{"$f":"IF(F16=0,0,F18/F16)","v":0}]
[null,"% verloren",null,null,null,{"$f":"IF(F16=0,0,F19/F16)","v":0.66666666666666663},null,"De Hambaken"]
[null,"Wedstrijdpunten",null,null,null,{"$f":"SUM(H32:H57)","v":9}]
[null,"Saldopunten",null,null,null,{"$f":"SUM(I32:I57)","v":-11}]
[null,"Saldopunten per wedstrijd",null,null,null,{"$f":"IF(F16=0,0,F24/F16)","v":-1.2222222222222223}]
[]
[]
[null,"LET OP: alleen wedstrijden die daadwerkelijk gespeeld zijn in de wijk waarvoor jij je hebt ingeschreven tellen mee!"]
[]
[]
[null,"Datum","Locatie","UITSLAGEN",null,null,"W, V of G?","Wedstrijd-punten","Saldo-punten"]
[null,"2021-06-23","De Hambaken",13,"-",8,{"$f":"IF(OR($B$13=\"\",wijk_van_inschrijving=\"\"),\"-\",IF(OR(wijk_van_inschrijving<>C32,D32=\"\",F32=\"\"),\"-\",IF(D32>F32,\"W\",IF(D32=F32,\"G\",IF(D32<F32,\"V\",\"-\")))))","v":"W"},{"$f":"IF(OR($B$13=\"\",wijk_van_inschrijving=\"\"),\"-\",IF(OR(wijk_van_inschrijving<>C32,G32=\"-\",G32=\"\"),\"-\",IF(G32=\"W\",3,IF(G32=\"G\",2,IF(G32=\"V\",0,0)))))","v":3},{"$f":"IF(OR($B$13=\"\",wijk_van_inschrijving=\"\"),\"-\",IF(wijk_van_inschrijving<>C32,\"-\",IF(D32>=0,IF(F32=\"\",\"-\",D32-F32))))","v":5}]
[null,"2021-06-23","De Hambaken",4,"-",9,"V",0,-5]
[null,"2021-06-23","De Hambaken",5,"-",12,"V",0,-7]
[null,"2021-06-29","De Hambaken",10,"-",4,"W",3,6]
[null,"2021-06-29","De Hambaken",2,"-",8,"V",0,-6]
[null,"2021-06-29","De Hambaken",12,"-",13,"V",0,-1]
[null,"2021-07-06","De Hambaken",11,"-",13,"V",0,-2]
[null,"2021-07-06","De Hambaken",5,"-",13,"V",0,-8]
[null,"2021-07-06","De Hambaken",12,"-",5,"W",3,7]
[null,null,null,null,"-",null,"-","-","-"]
[null,null,null,null,"-",null,"-","-","-"]
[null,null,null,null,"-",null,"-","-","-"]
[null,null,null,null,"-",null,"-","-","-"]
[null,null,null,null,"-",null,"-","-","-"]
[null,null,null,null,"-",null,"-","-","-"]
[null,null,null,null,"-",null,"-","-","-"]
[null,null,null,null,"-",null,"-","-","-"]
[null,null,null,null,"-",null,"-","-","-"]
[null,null,null,null,"-",null,"-","-","-"]
[null,null,null,null,"-",null,"-","-","-"]
[null,null,null,null,"-",null,"-","-","-"]
[null,null,null,null,"-",null,"-","-","-"]
[null,null,null,null,"-",null,"-","-","-"]
[null,null,null,null,"-",null,"-","-","-"]
[null,null,null,null,"-",null,"-","-","-"]

{"sheet":"Jan van den Akker","index":50,"n_rows":56,"n_cols":9,"rows_kept":56,"cut":false,"hidden":false,"merged":[[18,7,20,8],[30,3,30,5],[12,1,12,8],[15,1,15,4],[16,1,16,4],[17,1,17,4],[18,1,18,4],[19,1,19,4],[20,1,20,4],[21,1,21,4],[22,1,22,4],[23,1,23,4],[24,1,24,4],[21,7,21,8],[27,1,27,8]]}
[]
[]
[]
[]
[]
[]
[]
[]
[]
[]
[]
[]
[null,"Jan van den Akker"]
[]
[]
[null,"Gespeeld",null,null,null,{"$f":"COUNTIF(G32:G57,\"W\")+COUNTIF(G32:G57,\"G\")+COUNTIF(G32:G57,\"V\")","v":10}]
[null,"Gewonnen",null,null,null,{"$f":"COUNTIF(G32:G57,\"W\")","v":5}]
[null,"Gelijk",null,null,null,{"$f":"COUNTIF(G32:G57,\"G\")","v":0}]
[null,"Verloren",null,null,null,{"$f":"COUNTIF(G32:G57,\"V\")","v":5},null,"Wijk van initiële inschrijving\n(met shirtkleur finaledag)"]
[null,"% gewonnen",null,null,null,{"$f":"IF(F16=0,0,F17/F16)","v":0.5}]
[null,"% gelijk",null,null,null,{"$f":"IF(F16=0,0,F18/F16)","v":0}]
[null,"% verloren",null,null,null,{"$f":"IF(F16=0,0,F19/F16)","v":0.5},null,"De Schutskamp"]
[null,"Wedstrijdpunten",null,null,null,{"$f":"SUM(H32:H57)","v":15}]
[null,"Saldopunten",null,null,null,{"$f":"SUM(I32:I57)","v":6}]
[null,"Saldopunten per wedstrijd",null,null,null,{"$f":"IF(F16=0,0,F24/F16)","v":0.6}]
[]
[]
[null,"LET OP: alleen wedstrijden die daadwerkelijk gespeeld zijn in de wijk waarvoor jij je hebt ingeschreven tellen mee!"]
[]
[]
[null,"Datum","Locatie","UITSLAGEN",null,null,"W, V of G?","Wedstrijd-punten","Saldo-punten"]
[null,"2021-06-14","De Schutskamp",13,"-",7,{"$f":"IF(OR($B$13=\"\",wijk_van_inschrijving=\"\"),\"-\",IF(OR(wijk_van_inschrijving<>C32,D32=\"\",F32=\"\"),\"-\",IF(D32>F32,\"W\",IF(D32=F32,\"G\",IF(D32<F32,\"V\",\"-\")))))","v":"W"},{"$f":"IF(OR($B$13=\"\",wijk_van_inschrijving=\"\"),\"-\",IF(OR(wijk_van_inschrijving<>C32,G32=\"-\",G32=\"\"),\"-\",IF(G32=\"W\",3,IF(G32=\"G\",2,IF(G32=\"V\",0,0)))))","v":3},{"$f":"IF(OR($B$13=\"\",wijk_van_inschrijving=\"\"),\"-\",IF(wijk_van_inschrijving<>C32,\"-\",IF(D32>=0,IF(F32=\"\",\"-\",D32-F32))))","v":6}]
[null,"2021-06-14","De Schutskamp",4,"-",7,"V",0,-3]
[null,"2021-06-14","De Schutskamp",4,"-",9,"V",0,-5]
[null,"2021-06-24","De Schutskamp",6,"-",10,"V",0,-4]
[null,"2021-06-28","De Schutskamp",13,"-",3,"W",3,10]
[null,"2021-06-28","De Schutskamp",10,"-",7,"W",3,3]
[null,"2021-06-28","De Schutskamp",12,"-",6,"W",3,6]
[null,"2021-07-05","De Schutskamp",6,"-",13,"V",0,-7]
[null,"2021-07-05","De Schutskamp",3,"-",9,"V",0,-6]
[null,"2021-07-05","De Schutskamp",9,"-",3,"W",3,6]
[null,null,null,null,"-",null,"-","-","-"]
[null,null,null,null,"-",null,"-","-","-"]
[null,null,null,null,"-",null,"-","-","-"]
[null,null,null,null,"-",null,"-","-","-"]
[null,null,null,null,"-",null,"-","-","-"]
[null,null,null,null,"-",null,"-","-","-"]
[null,null,null,null,"-",null,"-","-","-"]
[null,null,null,null,"-",null,"-","-","-"]
[null,null,null,null,"-",null,"-","-","-"]
[null,null,null,null,"-",null,"-","-","-"]
[null,null,null,null,"-",null,"-","-","-"]
[null,null,null,null,"-",null,"-","-","-"]
[null,null,null,null,"-",null,"-","-","-"]
[null,null,null,null,"-",null,"-","-","-"]
[null,null,null,null,"-",null,"-","-","-"]

{"sheet":"Jan van Alebeek","index":51,"n_rows":56,"n_cols":9,"rows_kept":56,"cut":false,"hidden":false,"merged":[[18,7,20,8],[30,3,30,5],[12,1,12,8],[15,1,15,4],[16,1,16,4],[17,1,17,4],[18,1,18,4],[19,1,19,4],[20,1,20,4],[21,1,21,4],[22,1,22,4],[23,1,23,4],[24,1,24,4],[21,7,21,8],[27,1,27,8]]}
[]
[]
[]
[]
[]
[]
[]
[]
[]
[]
[]
[]
[null,"Jan van Alebeek"]
[]
[]
[null,"Gespeeld",null,null,null,{"$f":"COUNTIF(G32:G57,\"W\")+COUNTIF(G32:G57,\"G\")+COUNTIF(G32:G57,\"V\")","v":9}]
[null,"Gewonnen",null,null,null,{"$f":"COUNTIF(G32:G57,\"W\")","v":6}]
[null,"Gelijk",null,null,null,{"$f":"COUNTIF(G32:G57,\"G\")","v":1}]
[null,"Verloren",null,null,null,{"$f":"COUNTIF(G32:G57,\"V\")","v":2},null,"Wijk van initiële inschrijving\n(met shirtkleur finaledag)"]
[null,"% gewonnen",null,null,null,{"$f":"IF(F16=0,0,F17/F16)","v":0.66666666666666663}]
[null,"% gelijk",null,null,null,{"$f":"IF(F16=0,0,F18/F16)","v":0.1111111111111111}]
[null,"% verloren",null,null,null,{"$f":"IF(F16=0,0,F19/F16)","v":0.22222222222222221},null,"'s-Hertogenbosch Zuid"]
[null,"Wedstrijdpunten",null,null,null,{"$f":"SUM(H32:H57)","v":20}]
[null,"Saldopunten",null,null,null,{"$f":"SUM(I32:I57)","v":28}]
[null,"Saldopunten per wedstrijd",null,null,null,{"$f":"IF(F16=0,0,F24/F16)","v":3.1111111111111112}]
[]
[]
[null,"LET OP: alleen wedstrijden die daadwerkelijk gespeeld zijn in de wijk waarvoor jij je hebt ingeschreven tellen mee!"]
[]
[]
[null,"Datum","Locatie","UITSLAGEN",null,null,"W, V of G?","Wedstrijd-punten","Saldo-punten"]
[null,"2021-06-18","'s-Hertogenbosch Zuid",13,"-",2,{"$f":"IF(OR($B$13=\"\",wijk_van_inschrijving=\"\"),\"-\",IF(OR(wijk_van_inschrijving<>C32,D32=\"\",F32=\"\"),\"-\",IF(D32>F32,\"W\",IF(D32=F32,\"G\",IF(D32<F32,\"V\",\"-\")))))","v":"W"},{"$f":"IF(OR($B$13=\"\",wijk_van_inschrijving=\"\"),\"-\",IF(OR(wijk_van_inschrijving<>C32,G32=\"-\",G32=\"\"),\"-\",IF(G32=\"W\",3,IF(G32=\"G\",2,IF(G32=\"V\",0,0)))))","v":3},{"$f":"IF(OR($B$13=\"\",wijk_van_inschrijving=\"\"),\"-\",IF(wijk_van_inschrijving<>C32,\"-\",IF(D32>=0,IF(F32=\"\",\"-\",D32-F32))))","v":11}]
[null,"2021-06-18","'s-Hertogenbosch Zuid",4,"-",4,"G",2,0]
[null,"2021-06-18","'s-Hertogenbosch Zuid",13,"-",2,"W",3,11]
[null,"2021-07-01","'s-Hertogenbosch Zuid",9,"-",4,"W",3,5]
[null,"2021-07-01","'s-Hertogenbosch Zuid",11,"-",3,"W",3,8]
[null,"2021-07-01","'s-Hertogenbosch Zuid",8,"-",12,"V",0,-4]
[null,"2021-07-08","'s-Hertogenbosch Zuid",3,"-",13,"V",0,-10]
[null,"2021-07-08","'s-Hertogenbosch Zuid",11,"-",5,"W",3,6]
[null,"2021-07-08","'s-Hertogenbosch Zuid",6,"-",5,"W",3,1]
[null,null,null,null,"-",null,"-","-","-"]
[null,null,null,null,"-",null,"-","-","-"]
[null,null,null,null,"-",null,"-","-","-"]
[null,null,null,null,"-",null,"-","-","-"]
[null,null,null,null,"-",null,"-","-","-"]
[null,null,null,null,"-",null,"-","-","-"]
[null,null,null,null,"-",null,"-","-","-"]
[null,null,null,null,"-",null,"-","-","-"]
[null,null,null,null,"-",null,"-","-","-"]
[null,null,null,null,"-",null,"-","-","-"]
[null,null,null,null,"-",null,"-","-","-"]
[null,null,null,null,"-",null,"-","-","-"]
[null,null,null,null,"-",null,"-","-","-"]
[null,null,null,null,"-",null,"-","-","-"]
[null,null,null,null,"-",null,"-","-","-"]
[null,null,null,null,"-",null,"-","-","-"]

{"sheet":"Jan van den Broek","index":52,"n_rows":56,"n_cols":9,"rows_kept":56,"cut":false,"hidden":false,"merged":[[18,7,20,8],[30,3,30,5],[12,1,12,8],[15,1,15,4],[16,1,16,4],[17,1,17,4],[18,1,18,4],[19,1,19,4],[20,1,20,4],[21,1,21,4],[22,1,22,4],[23,1,23,4],[24,1,24,4],[21,7,21,8],[27,1,27,8]]}
[]
[]
[]
[]
[]
[]
[]
[]
[]
[]
[]
[]
[null,"Jan van den Broek"]
[]
[]
[null,"Gespeeld",null,null,null,{"$f":"COUNTIF(G32:G57,\"W\")+COUNTIF(G32:G57,\"G\")+COUNTIF(G32:G57,\"V\")","v":7}]
[null,"Gewonnen",null,null,null,{"$f":"COUNTIF(G32:G57,\"W\")","v":4}]
[null,"Gelijk",null,null,null,{"$f":"COUNTIF(G32:G57,\"G\")","v":1}]
[null,"Verloren",null,null,null,{"$f":"COUNTIF(G32:G57,\"V\")","v":2},null,"Wijk van initiële inschrijving\n(met shirtkleur finaledag)"]
[null,"% gewonnen",null,null,null,{"$f":"IF(F16=0,0,F17/F16)","v":0.5714285714285714}]
[null,"% gelijk",null,null,null,{"$f":"IF(F16=0,0,F18/F16)","v":0.14285714285714285}]
[null,"% verloren",null,null,null,{"$f":"IF(F16=0,0,F19/F16)","v":0.2857142857142857},null,"Hondsberg (Rosmalen)"]
[null,"Wedstrijdpunten",null,null,null,{"$f":"SUM(H32:H57)","v":14}]
[null,"Saldopunten",null,null,null,{"$f":"SUM(I32:I57)","v":11}]
[null,"Saldopunten per wedstrijd",null,null,null,{"$f":"IF(F16=0,0,F24/F16)","v":1.5714285714285714}]
[]
[]
[null,"LET OP: alleen wedstrijden die daadwerkelijk gespeeld zijn in de wijk waarvoor jij je hebt ingeschreven tellen mee!"]
[]
[]
[null,"Datum","Locatie","UITSLAGEN",null,null,"W, V of G?","Wedstrijd-punten","Saldo-punten"]
[null,"2021-06-15","Hondsberg (Rosmalen)",8,"-",5,{"$f":"IF(OR($B$13=\"\",wijk_van_inschrijving=\"\"),\"-\",IF(OR(wijk_van_inschrijving<>C32,D32=\"\",F32=\"\"),\"-\",IF(D32>F32,\"W\",IF(D32=F32,\"G\",IF(D32<F32,\"V\",\"-\")))))","v":"W"},{"$f":"IF(OR($B$13=\"\",wijk_van_inschrijving=\"\"),\"-\",IF(OR(wijk_van_inschrijving<>C32,G32=\"-\",G32=\"\"),\"-\",IF(G32=\"W\",3,IF(G32=\"G\",2,IF(G32=\"V\",0,0)))))","v":3},{"$f":"IF(OR($B$13=\"\",wijk_van_inschrijving=\"\"),\"-\",IF(wijk_van_inschrijving<>C32,\"-\",IF(D32>=0,IF(F32=\"\",\"-\",D32-F32))))","v":3}]
[null,"2021-06-15","Hondsberg (Rosmalen)",6,"-",6,"G",2,0]
[null,"2021-06-15","Hondsberg (Rosmalen)",13,"-",5,"W",3,8]
[null,"2021-06-22","Hondsberg (Rosmalen)",11,"-",2,"W",3,9]
[null,"2021-06-22","Hondsberg (Rosmalen)",5,"-",11,"V",0,-6]
[null,"2021-06-30","Hondsberg (Rosmalen)",5,"-",13,"V",0,-8]
[null,"2021-06-30","Hondsberg (Rosmalen)",7,"-",2,"W",3,5]
[null,null,null,null,"-",null,"-","-","-"]
[null,null,null,null,"-",null,"-","-","-"]
[null,null,null,null,"-",null,"-","-","-"]
[null,null,null,null,"-",null,"-","-","-"]
[null,null,null,null,"-",null,"-","-","-"]
[null,null,null,null,"-",null,"-","-","-"]
[null,null,null,null,"-",null,"-","-","-"]
[null,null,null,null,"-",null,"-","-","-"]
[null,null,null,null,"-",null,"-","-","-"]
[null,null,null,null,"-",null,"-","-","-"]
[null,null,null,null,"-",null,"-","-","-"]
[null,null,null,null,"-",null,"-","-","-"]
[null,null,null,null,"-",null,"-","-","-"]
[null,null,null,null,"-",null,"-","-","-"]
[null,null,null,null,"-",null,"-","-","-"]
[null,null,null,null,"-",null,"-","-","-"]
[null,null,null,null,"-",null,"-","-","-"]
[null,null,null,null,"-",null,"-","-","-"]

{"sheet":"Jan Wijnhoven","index":53,"n_rows":56,"n_cols":9,"rows_kept":56,"cut":false,"hidden":false,"merged":[[18,7,20,8],[30,3,30,5],[12,1,12,8],[15,1,15,4],[16,1,16,4],[17,1,17,4],[18,1,18,4],[19,1,19,4],[20,1,20,4],[21,1,21,4],[22,1,22,4],[23,1,23,4],[24,1,24,4],[21,7,21,8],[27,1,27,8]]}
[]
[]
[]
[]
[]
[]
[]
[]
[]
[]
[]
[]
[null,"Jan Wijnhoven"]
[]
[]
[null,"Gespeeld",null,null,null,{"$f":"COUNTIF(G32:G57,\"W\")+COUNTIF(G32:G57,\"G\")+COUNTIF(G32:G57,\"V\")","v":9}]
[null,"Gewonnen",null,null,null,{"$f":"COUNTIF(G32:G57,\"W\")","v":3}]
[null,"Gelijk",null,null,null,{"$f":"COUNTIF(G32:G57,\"G\")","v":0}]
[null,"Verloren",null,null,null,{"$f":"COUNTIF(G32:G57,\"V\")","v":6},null,"Wijk van initiële inschrijving\n(met shirtkleur finaledag)"]
[null,"% gewonnen",null,null,null,{"$f":"IF(F16=0,0,F17/F16)","v":0.33333333333333331}]
[null,"% gelijk",null,null,null,{"$f":"IF(F16=0,0,F18/F16)","v":0}]
[null,"% verloren",null,null,null,{"$f":"IF(F16=0,0,F19/F16)","v":0.66666666666666663},null,"De Schutskamp"]
[null,"Wedstrijdpunten",null,null,null,{"$f":"SUM(H32:H57)","v":9}]
[null,"Saldopunten",null,null,null,{"$f":"SUM(I32:I57)","v":-34}]
[null,"Saldopunten per wedstrijd",null,null,null,{"$f":"IF(F16=0,0,F24/F16)","v":-3.7777777777777777}]
[]
[]
[null,"LET OP: alleen wedstrijden die daadwerkelijk gespeeld zijn in de wijk waarvoor jij je hebt ingeschreven tellen mee!"]
[]
[]
[null,"Datum","Locatie","UITSLAGEN",null,null,"W, V of G?","Wedstrijd-punten","Saldo-punten"]
[null,"2021-06-14","De Schutskamp",5,"-",9,{"$f":"IF(OR($B$13=\"\",wijk_van_inschrijving=\"\"),\"-\",IF(OR(wijk_van_inschrijving<>C32,D32=\"\",F32=\"\"),\"-\",IF(D32>F32,\"W\",IF(D32=F32,\"G\",IF(D32<F32,\"V\",\"-\")))))","v":"V"},{"$f":"IF(OR($B$13=\"\",wijk_van_inschrijving=\"\"),\"-\",IF(OR(wijk_van_inschrijving<>C32,G32=\"-\",G32=\"\"),\"-\",IF(G32=\"W\",3,IF(G32=\"G\",2,IF(G32=\"V\",0,0)))))","v":0},{"$f":"IF(OR($B$13=\"\",wijk_van_inschrijving=\"\"),\"-\",IF(wijk_van_inschrijving<>C32,\"-\",IF(D32>=0,IF(F32=\"\",\"-\",D32-F32))))","v":-4}]
[null,"2021-06-14","De Schutskamp",7,"-",4,"W",3,3]
[null,"2021-06-24","De Schutskamp",3,"-",13,"V",0,-10]
[null,"2021-06-28","De Schutskamp",3,"-",13,"V",0,-10]
[null,"2021-06-28","De Schutskamp",5,"-",3,"W",3,2]
[null,"2021-06-28","De Schutskamp",1,"-",7,"V",0,-6]
[null,"2021-07-05","De Schutskamp",10,"-",6,"W",3,4]
[null,"2021-07-05","De Schutskamp",6,"-",13,"V",0,-7]
[null,"2021-07-05","De Schutskamp",3,"-",9,"V",0,-6]
[null,null,null,null,"-",null,"-","-","-"]
[null,null,null,null,"-",null,"-","-","-"]
[null,null,null,null,"-",null,"-","-","-"]
[null,null,null,null,"-",null,"-","-","-"]
[null,null,null,null,"-",null,"-","-","-"]
[null,null,null,null,"-",null,"-","-","-"]
[null,null,null,null,"-",null,"-","-","-"]
[null,null,null,null,"-",null,"-","-","-"]
[null,null,null,null,"-",null,"-","-","-"]
[null,null,null,null,"-",null,"-","-","-"]
[null,null,null,null,"-",null,"-","-","-"]
[null,null,null,null,"-",null,"-","-","-"]
[null,null,null,null,"-",null,"-","-","-"]
[null,null,null,null,"-",null,"-","-","-"]
[null,null,null,null,"-",null,"-","-","-"]
[null,null,null,null,"-",null,"-","-","-"]

{"sheet":"Jilali Hasnaoui","index":54,"n_rows":56,"n_cols":9,"rows_kept":56,"cut":false,"hidden":false,"merged":[[27,1,27,8],[30,3,30,5],[20,1,20,4],[21,7,21,8],[21,1,21,4],[22,1,22,4],[23,1,23,4],[24,1,24,4],[18,7,20,8],[19,1,19,4],[12,1,12,8],[15,1,15,4],[16,1,16,4],[17,1,17,4],[18,1,18,4]]}
[]
[]
[]
[]
[]
[]
[]
[]
[]
[]
[]
[]
[null,"Jilali Hasnaoui"]
[]
[]
[null,"Gespeeld",null,null,null,{"$f":"COUNTIF(G32:G57,\"W\")+COUNTIF(G32:G57,\"G\")+COUNTIF(G32:G57,\"V\")","v":4}]
[null,"Gewonnen",null,null,null,{"$f":"COUNTIF(G32:G57,\"W\")","v":1}]
[null,"Gelijk",null,null,null,{"$f":"COUNTIF(G32:G57,\"G\")","v":0}]
[null,"Verloren",null,null,null,{"$f":"COUNTIF(G32:G57,\"V\")","v":3},null,"Wijk van initiële inschrijving\n(met shirtkleur finaledag)"]
[null,"% gewonnen",null,null,null,{"$f":"IF(F16=0,0,F17/F16)","v":0.25}]
[null,"% gelijk",null,null,null,{"$f":"IF(F16=0,0,F18/F16)","v":0}]
[null,"% verloren",null,null,null,{"$f":"IF(F16=0,0,F19/F16)","v":0.75},null,"De Schutskamp"]
[null,"Wedstrijdpunten",null,null,null,{"$f":"SUM(H32:H57)","v":3}]
[null,"Saldopunten",null,null,null,{"$f":"SUM(I32:I57)","v":-6}]
[null,"Saldopunten per wedstrijd",null,null,null,{"$f":"IF(F16=0,0,F24/F16)","v":-1.5}]
[]
[]
[null,"LET OP: alleen wedstrijden die daadwerkelijk gespeeld zijn in de wijk waarvoor jij je hebt ingeschreven tellen mee!"]
[]
[]
[null,"Datum","Locatie","UITSLAGEN",null,null,"W, V of G?","Wedstrijd-punten","Saldo-punten"]
[null,"2021-06-28","De Schutskamp",7,"-",8,{"$f":"IF(OR($B$13=\"\",wijk_van_inschrijving=\"\"),\"-\",IF(OR(wijk_van_inschrijving<>C32,D32=\"\",F32=\"\"),\"-\",IF(D32>F32,\"W\",IF(D32=F32,\"G\",IF(D32<F32,\"V\",\"-\")))))","v":"V"},{"$f":"IF(OR($B$13=\"\",wijk_van_inschrijving=\"\"),\"-\",IF(OR(wijk_van_inschrijving<>C32,G32=\"-\",G32=\"\"),\"-\",IF(G32=\"W\",3,IF(G32=\"G\",2,IF(G32=\"V\",0,0)))))","v":0},{"$f":"IF(OR($B$13=\"\",wijk_van_inschrijving=\"\"),\"-\",IF(wijk_van_inschrijving<>C32,\"-\",IF(D32>=0,IF(F32=\"\",\"-\",D32-F32))))","v":-1}]
[null,"2021-06-28","De Schutskamp",7,"-",8,"V",0,-1]
[null,"2021-07-05","De Schutskamp",3,"-",9,"V",0,-6]
[null,"2021-07-05","De Schutskamp",8,"-",6,"W",3,2]
[null,null,null,null,"-",null,"-","-","-"]
[null,null,null,null,"-",null,"-","-","-"]
[null,null,null,null,"-",null,"-","-","-"]
[null,null,null,null,"-",null,"-","-","-"]
[null,null,null,null,"-",null,"-","-","-"]
[null,null,null,null,"-",null,"-","-","-"]
[null,null,null,null,"-",null,"-","-","-"]
[null,null,null,null,"-",null,"-","-","-"]
[null,null,null,null,"-",null,"-","-","-"]
[null,null,null,null,"-",null,"-","-","-"]
[null,null,null,null,"-",null,"-","-","-"]
[null,null,null,null,"-",null,"-","-","-"]
[null,null,null,null,"-",null,"-","-","-"]
[null,null,null,null,"-",null,"-","-","-"]
[null,null,null,null,"-",null,"-","-","-"]
[null,null,null,null,"-",null,"-","-","-"]
[null,null,null,null,"-",null,"-","-","-"]
[null,null,null,null,"-",null,"-","-","-"]
[null,null,null,null,"-",null,"-","-","-"]
[null,null,null,null,"-",null,"-","-","-"]
[null,null,null,null,"-",null,"-","-","-"]

{"sheet":"John den Houter","index":55,"n_rows":56,"n_cols":9,"rows_kept":56,"cut":false,"hidden":false,"merged":[[27,1,27,8],[30,3,30,5],[20,1,20,4],[21,7,21,8],[21,1,21,4],[22,1,22,4],[23,1,23,4],[24,1,24,4],[18,7,20,8],[19,1,19,4],[12,1,12,8],[15,1,15,4],[16,1,16,4],[17,1,17,4],[18,1,18,4]]}
[]
[]
[]
[]
[]
[]
[]
[]
[]
[]
[]
[]
[null,"John den Houter"]
[]
[]
[null,"Gespeeld",null,null,null,{"$f":"COUNTIF(G32:G57,\"W\")+COUNTIF(G32:G57,\"G\")+COUNTIF(G32:G57,\"V\")","v":8}]
[null,"Gewonnen",null,null,null,{"$f":"COUNTIF(G32:G57,\"W\")","v":3}]
[null,"Gelijk",null,null,null,{"$f":"COUNTIF(G32:G57,\"G\")","v":0}]
[null,"Verloren",null,null,null,{"$f":"COUNTIF(G32:G57,\"V\")","v":5},null,"Wijk van initiële inschrijving\n(met shirtkleur finaledag)"]
[null,"% gewonnen",null,null,null,{"$f":"IF(F16=0,0,F17/F16)","v":0.375}]
[null,"% gelijk",null,null,null,{"$f":"IF(F16=0,0,F18/F16)","v":0}]
[null,"% verloren",null,null,null,{"$f":"IF(F16=0,0,F19/F16)","v":0.625},null,"Hondsberg (Rosmalen)"]
[null,"Wedstrijdpunten",null,null,null,{"$f":"SUM(H32:H57)","v":9}]
[null,"Saldopunten",null,null,null,{"$f":"SUM(I32:I57)","v":-10}]
[null,"Saldopunten per wedstrijd",null,null,null,{"$f":"IF(F16=0,0,F24/F16)","v":-1.25}]
[]
[]
[null,"LET OP: alleen wedstrijden die daadwerkelijk gespeeld zijn in de wijk waarvoor jij je hebt ingeschreven tellen mee!"]
[]
[]
[null,"Datum","Locatie","UITSLAGEN",null,null,"W, V of G?","Wedstrijd-punten","Saldo-punten"]
[null,"2021-06-22","Hondsberg (Rosmalen)",2,"-",9,{"$f":"IF(OR($B$13=\"\",wijk_van_inschrijving=\"\"),\"-\",IF(OR(wijk_van_inschrijving<>C32,D32=\"\",F32=\"\"),\"-\",IF(D32>F32,\"W\",IF(D32=F32,\"G\",IF(D32<F32,\"V\",\"-\")))))","v":"V"},{"$f":"IF(OR($B$13=\"\",wijk_van_inschrijving=\"\"),\"-\",IF(OR(wijk_van_inschrijving<>C32,G32=\"-\",G32=\"\"),\"-\",IF(G32=\"W\",3,IF(G32=\"G\",2,IF(G32=\"V\",0,0)))))","v":0},{"$f":"IF(OR($B$13=\"\",wijk_van_inschrijving=\"\"),\"-\",IF(wijk_van_inschrijving<>C32,\"-\",IF(D32>=0,IF(F32=\"\",\"-\",D32-F32))))","v":-7}]
[null,"2021-06-22","Hondsberg (Rosmalen)",13,"-",6,"W",3,7]
[null,"2021-06-30","Hondsberg (Rosmalen)",9,"-",11,"V",0,-2]
[null,"2021-06-30","Hondsberg (Rosmalen)",7,"-",6,"W",3,1]
[null,"2021-06-30","Hondsberg (Rosmalen)",5,"-",13,"V",0,-8]
[null,"2021-07-07","Hondsberg (Rosmalen)",6,"-",9,"V",0,-3]
[null,"2021-07-07","Hondsberg (Rosmalen)",11,"-",3,"W",3,8]
[null,"2021-07-07","Hondsberg (Rosmalen)",1,"-",7,"V",0,-6]
[null,null,null,null,"-",null,"-","-","-"]
[null,null,null,null,"-",null,"-","-","-"]
[null,null,null,null,"-",null,"-","-","-"]
[null,null,null,null,"-",null,"-","-","-"]
[null,null,null,null,"-",null,"-","-","-"]
[null,null,null,null,"-",null,"-","-","-"]
[null,null,null,null,"-",null,"-","-","-"]
[null,null,null,null,"-",null,"-","-","-"]
[null,null,null,null,"-",null,"-","-","-"]
[null,null,null,null,"-",null,"-","-","-"]
[null,null,null,null,"-",null,"-","-","-"]
[null,null,null,null,"-",null,"-","-","-"]
[null,null,null,null,"-",null,"-","-","-"]
[null,null,null,null,"-",null,"-","-","-"]
[null,null,null,null,"-",null,"-","-","-"]
[null,null,null,null,"-",null,"-","-","-"]
[null,null,null,null,"-",null,"-","-","-"]

{"sheet":"John Kuijpers","index":56,"n_rows":56,"n_cols":9,"rows_kept":56,"cut":false,"hidden":false,"merged":[[18,7,20,8],[30,3,30,5],[12,1,12,8],[15,1,15,4],[16,1,16,4],[17,1,17,4],[18,1,18,4],[19,1,19,4],[20,1,20,4],[21,1,21,4],[22,1,22,4],[23,1,23,4],[24,1,24,4],[21,7,21,8],[27,1,27,8]]}
[]
[]
[]
[]
[]
[]
[]
[]
[]
[]
[]
[]
[null,"John Kuijpers"]
[]
[]
[null,"Gespeeld",null,null,null,{"$f":"COUNTIF(G32:G57,\"W\")+COUNTIF(G32:G57,\"G\")+COUNTIF(G32:G57,\"V\")","v":12}]
[null,"Gewonnen",null,null,null,{"$f":"COUNTIF(G32:G57,\"W\")","v":9}]
[null,"Gelijk",null,null,null,{"$f":"COUNTIF(G32:G57,\"G\")","v":0}]
[null,"Verloren",null,null,null,{"$f":"COUNTIF(G32:G57,\"V\")","v":3},null,"Wijk van initiële inschrijving\n(met shirtkleur finaledag)"]
[null,"% gewonnen",null,null,null,{"$f":"IF(F16=0,0,F17/F16)","v":0.75}]
[null,"% gelijk",null,null,null,{"$f":"IF(F16=0,0,F18/F16)","v":0}]
[null,"% verloren",null,null,null,{"$f":"IF(F16=0,0,F19/F16)","v":0.25},null,"De Schutskamp"]
[null,"Wedstrijdpunten",null,null,null,{"$f":"SUM(H32:H57)","v":27}]
[null,"Saldopunten",null,null,null,{"$f":"SUM(I32:I57)","v":41}]
[null,"Saldopunten per wedstrijd",null,null,null,{"$f":"IF(F16=0,0,F24/F16)","v":3.4166666666666665}]
[]
[]
[null,"LET OP: alleen wedstrijden die daadwerkelijk gespeeld zijn in de wijk waarvoor jij je hebt ingeschreven tellen mee!"]
[]
[]
[null,"Datum","Locatie","UITSLAGEN",null,null,"W, V of G?","Wedstrijd-punten","Saldo-punten"]
[null,"2021-06-14","De Schutskamp",9,"-",5,{"$f":"IF(OR($B$13=\"\",wijk_van_inschrijving=\"\"),\"-\",IF(OR(wijk_van_inschrijving<>C32,D32=\"\",F32=\"\"),\"-\",IF(D32>F32,\"W\",IF(D32=F32,\"G\",IF(D32<F32,\"V\",\"-\")))))","v":"W"},{"$f":"IF(OR($B$13=\"\",wijk_van_inschrijving=\"\"),\"-\",IF(OR(wijk_van_inschrijving<>C32,G32=\"-\",G32=\"\"),\"-\",IF(G32=\"W\",3,IF(G32=\"G\",2,IF(G32=\"V\",0,0)))))","v":3},{"$f":"IF(OR($B$13=\"\",wijk_van_inschrijving=\"\"),\"-\",IF(wijk_van_inschrijving<>C32,\"-\",IF(D32>=0,IF(F32=\"\",\"-\",D32-F32))))","v":4}]
[null,"2021-06-14","De Schutskamp",7,"-",4,"W",3,3]
[null,"2021-06-14","De Schutskamp",13,"-",2,"W",3,11]
[null,"2021-06-24","De Schutskamp",13,"-",3,"W",3,10]
[null,"2021-06-24","De Schutskamp",9,"-",6,"W",3,3]
[null,"2021-06-24","De Schutskamp",11,"-",7,"W",3,4]
[null,"2021-06-28","De Schutskamp",3,"-",12,"V",0,-9]
[null,"2021-06-28","De Schutskamp",7,"-",10,"V",0,-3]
[null,"2021-06-28","De Schutskamp",7,"-",8,"V",0,-1]
[null,"2021-07-05","De Schutskamp",8,"-",6,"W",3,2]
[null,"2021-07-05","De Schutskamp",13,"-",2,"W",3,11]
[null,"2021-07-05","De Schutskamp",9,"-",3,"W",3,6]
[null,null,null,null,"-",null,"-","-","-"]
[null,null,null,null,"-",null,"-","-","-"]
[null,null,null,null,"-",null,"-","-","-"]
[null,null,null,null,"-",null,"-","-","-"]
[null,null,null,null,"-",null,"-","-","-"]
[null,null,null,null,"-",null,"-","-","-"]
[null,null,null,null,"-",null,"-","-","-"]
[null,null,null,null,"-",null,"-","-","-"]
[null,null,null,null,"-",null,"-","-","-"]
[null,null,null,null,"-",null,"-","-","-"]
[null,null,null,null,"-",null,"-","-","-"]
[null,null,null,null,"-",null,"-","-","-"]
[null,null,null,null,"-",null,"-","-","-"]

{"sheet":"Jonne Schophuizen","index":57,"n_rows":56,"n_cols":9,"rows_kept":56,"cut":false,"hidden":false,"merged":[[27,1,27,8],[30,3,30,5],[20,1,20,4],[21,7,21,8],[21,1,21,4],[22,1,22,4],[23,1,23,4],[24,1,24,4],[18,7,20,8],[19,1,19,4],[12,1,12,8],[15,1,15,4],[16,1,16,4],[17,1,17,4],[18,1,18,4]]}
[]
[]
[]
[]
[]
[]
[]
[]
[]
[]
[]
[]
[null,"Jonne Schophuizen"]
[]
[]
[null,"Gespeeld",null,null,null,{"$f":"COUNTIF(G32:G57,\"W\")+COUNTIF(G32:G57,\"G\")+COUNTIF(G32:G57,\"V\")","v":9}]
[null,"Gewonnen",null,null,null,{"$f":"COUNTIF(G32:G57,\"W\")","v":3}]
[null,"Gelijk",null,null,null,{"$f":"COUNTIF(G32:G57,\"G\")","v":2}]
[null,"Verloren",null,null,null,{"$f":"COUNTIF(G32:G57,\"V\")","v":4},null,"Wijk van initiële inschrijving\n(met shirtkleur finaledag)"]
[null,"% gewonnen",null,null,null,{"$f":"IF(F16=0,0,F17/F16)","v":0.33333333333333331}]
[null,"% gelijk",null,null,null,{"$f":"IF(F16=0,0,F18/F16)","v":0.22222222222222221}]
[null,"% verloren",null,null,null,{"$f":"IF(F16=0,0,F19/F16)","v":0.44444444444444442},null,"De Schutskamp"]
[null,"Wedstrijdpunten",null,null,null,{"$f":"SUM(H32:H57)","v":13}]
[null,"Saldopunten",null,null,null,{"$f":"SUM(I32:I57)","v":1}]
[null,"Saldopunten per wedstrijd",null,null,null,{"$f":"IF(F16=0,0,F24/F16)","v":0.1111111111111111}]
[]
[]
[null,"LET OP: alleen wedstrijden die daadwerkelijk gespeeld zijn in de wijk waarvoor jij je hebt ingeschreven tellen mee!"]
[]
[]
[null,"Datum","Locatie","UITSLAGEN",null,null,"W, V of G?","Wedstrijd-punten","Saldo-punten"]
[null,"2021-06-24","De Schutskamp",7,"-",11,{"$f":"IF(OR($B$13=\"\",wijk_van_inschrijving=\"\"),\"-\",IF(OR(wijk_van_inschrijving<>C32,D32=\"\",F32=\"\"),\"-\",IF(D32>F32,\"W\",IF(D32=F32,\"G\",IF(D32<F32,\"V\",\"-\")))))","v":"V"},{"$f":"IF(OR($B$13=\"\",wijk_van_inschrijving=\"\"),\"-\",IF(OR(wijk_van_inschrijving<>C32,G32=\"-\",G32=\"\"),\"-\",IF(G32=\"W\",3,IF(G32=\"G\",2,IF(G32=\"V\",0,0)))))","v":0},{"$f":"IF(OR($B$13=\"\",wijk_van_inschrijving=\"\"),\"-\",IF(wijk_van_inschrijving<>C32,\"-\",IF(D32>=0,IF(F32=\"\",\"-\",D32-F32))))","v":-4}]
[null,"2021-06-24","De Schutskamp",9,"-",6,"W",3,3]
[null,"2021-06-24","De Schutskamp",11,"-",11,"G",2,0]
[null,"2021-06-28","De Schutskamp",5,"-",13,"V",0,-8]
[null,"2021-06-28","De Schutskamp",7,"-",10,"V",0,-3]
[null,"2021-06-28","De Schutskamp",9,"-",9,"G",2,0]
[null,"2021-07-05","De Schutskamp",13,"-",6,"W",3,7]
[null,"2021-07-05","De Schutskamp",8,"-",12,"V",0,-4]
[null,"2021-07-05","De Schutskamp",13,"-",3,"W",3,10]
[null,null,null,null,"-",null,"-","-","-"]
[null,null,null,null,"-",null,"-","-","-"]
[null,null,null,null,"-",null,"-","-","-"]
[null,null,null,null,"-",null,"-","-","-"]
[null,null,null,null,"-",null,"-","-","-"]
[null,null,null,null,"-",null,"-","-","-"]
[null,null,null,null,"-",null,"-","-","-"]
[null,null,null,null,"-",null,"-","-","-"]
[null,null,null,null,"-",null,"-","-","-"]
[null,null,null,null,"-",null,"-","-","-"]
[null,null,null,null,"-",null,"-","-","-"]
[null,null,null,null,"-",null,"-","-","-"]
[null,null,null,null,"-",null,"-","-","-"]
[null,null,null,null,"-",null,"-","-","-"]
[null,null,null,null,"-",null,"-","-","-"]
[null,null,null,null,"-",null,"-","-","-"]

{"sheet":"Jos de Kort","index":58,"n_rows":56,"n_cols":9,"rows_kept":56,"cut":false,"hidden":false,"merged":[[27,1,27,8],[30,3,30,5],[20,1,20,4],[21,7,21,8],[21,1,21,4],[22,1,22,4],[23,1,23,4],[24,1,24,4],[18,7,20,8],[19,1,19,4],[12,1,12,8],[15,1,15,4],[16,1,16,4],[17,1,17,4],[18,1,18,4]]}
[]
[]
[]
[]
[]
[]
[]
[]
[]
[]
[]
[]
[null,"Jos de Kort"]
[]
[]
[null,"Gespeeld",null,null,null,{"$f":"COUNTIF(G32:G57,\"W\")+COUNTIF(G32:G57,\"G\")+COUNTIF(G32:G57,\"V\")","v":3}]
[null,"Gewonnen",null,null,null,{"$f":"COUNTIF(G32:G57,\"W\")","v":2}]
[null,"Gelijk",null,null,null,{"$f":"COUNTIF(G32:G57,\"G\")","v":0}]
[null,"Verloren",null,null,null,{"$f":"COUNTIF(G32:G57,\"V\")","v":1},null,"Wijk van initiële inschrijving\n(met shirtkleur finaledag)"]
[null,"% gewonnen",null,null,null,{"$f":"IF(F16=0,0,F17/F16)","v":0.66666666666666663}]
[null,"% gelijk",null,null,null,{"$f":"IF(F16=0,0,F18/F16)","v":0}]
[null,"% verloren",null,null,null,{"$f":"IF(F16=0,0,F19/F16)","v":0.33333333333333331},null,"De Schutskamp"]
[null,"Wedstrijdpunten",null,null,null,{"$f":"SUM(H32:H57)","v":6}]
[null,"Saldopunten",null,null,null,{"$f":"SUM(I32:I57)","v":5}]
[null,"Saldopunten per wedstrijd",null,null,null,{"$f":"IF(F16=0,0,F24/F16)","v":1.6666666666666667}]
[]
[]
[null,"LET OP: alleen wedstrijden die daadwerkelijk gespeeld zijn in de wijk waarvoor jij je hebt ingeschreven tellen mee!"]
[]
[]
[null,"Datum","Locatie","UITSLAGEN",null,null,"W, V of G?","Wedstrijd-punten","Saldo-punten"]
[null,"2021-06-24","De Schutskamp",11,"-",7,{"$f":"IF(OR($B$13=\"\",wijk_van_inschrijving=\"\"),\"-\",IF(OR(wijk_van_inschrijving<>C32,D32=\"\",F32=\"\"),\"-\",IF(D32>F32,\"W\",IF(D32=F32,\"G\",IF(D32<F32,\"V\",\"-\")))))","v":"W"},{"$f":"IF(OR($B$13=\"\",wijk_van_inschrijving=\"\"),\"-\",IF(OR(wijk_van_inschrijving<>C32,G32=\"-\",G32=\"\"),\"-\",IF(G32=\"W\",3,IF(G32=\"G\",2,IF(G32=\"V\",0,0)))))","v":3},{"$f":"IF(OR($B$13=\"\",wijk_van_inschrijving=\"\"),\"-\",IF(wijk_van_inschrijving<>C32,\"-\",IF(D32>=0,IF(F32=\"\",\"-\",D32-F32))))","v":4}]
[null,"2021-06-24","De Schutskamp",6,"-",9,"V",0,-3]
[null,"2021-06-24","De Schutskamp",12,"-",8,"W",3,4]
[null,null,null,null,"-",null,"-","-","-"]
[null,null,null,null,"-",null,"-","-","-"]
[null,null,null,null,"-",null,"-","-","-"]
[null,null,null,null,"-",null,"-","-","-"]
[null,null,null,null,"-",null,"-","-","-"]
[null,null,null,null,"-",null,"-","-","-"]
[null,null,null,null,"-",null,"-","-","-"]
[null,null,null,null,"-",null,"-","-","-"]
[null,null,null,null,"-",null,"-","-","-"]
[null,null,null,null,"-",null,"-","-","-"]
[null,null,null,null,"-",null,"-","-","-"]
[null,null,null,null,"-",null,"-","-","-"]
[null,null,null,null,"-",null,"-","-","-"]
[null,null,null,null,"-",null,"-","-","-"]
[null,null,null,null,"-",null,"-","-","-"]
[null,null,null,null,"-",null,"-","-","-"]
[null,null,null,null,"-",null,"-","-","-"]
[null,null,null,null,"-",null,"-","-","-"]
[null,null,null,null,"-",null,"-","-","-"]
[null,null,null,null,"-",null,"-","-","-"]
[null,null,null,null,"-",null,"-","-","-"]
[null,null,null,null,"-",null,"-","-","-"]

{"sheet":"José van den Broek","index":59,"n_rows":56,"n_cols":9,"rows_kept":56,"cut":false,"hidden":false,"merged":[[18,7,20,8],[30,3,30,5],[12,1,12,8],[15,1,15,4],[16,1,16,4],[17,1,17,4],[18,1,18,4],[19,1,19,4],[20,1,20,4],[21,1,21,4],[22,1,22,4],[23,1,23,4],[24,1,24,4],[21,7,21,8],[27,1,27,8]]}
[]
[]
[]
[]
[]
[]
[]
[]
[]
[]
[]
[]
[null,"José van den Broek"]
[]
[]
[null,"Gespeeld",null,null,null,{"$f":"COUNTIF(G32:G57,\"W\")+COUNTIF(G32:G57,\"G\")+COUNTIF(G32:G57,\"V\")","v":7}]
[null,"Gewonnen",null,null,null,{"$f":"COUNTIF(G32:G57,\"W\")","v":2}]
[null,"Gelijk",null,null,null,{"$f":"COUNTIF(G32:G57,\"G\")","v":2}]
[null,"Verloren",null,null,null,{"$f":"COUNTIF(G32:G57,\"V\")","v":3},null,"Wijk van initiële inschrijving\n(met shirtkleur finaledag)"]
[null,"% gewonnen",null,null,null,{"$f":"IF(F16=0,0,F17/F16)","v":0.2857142857142857}]
[null,"% gelijk",null,null,null,{"$f":"IF(F16=0,0,F18/F16)","v":0.2857142857142857}]
[null,"% verloren",null,null,null,{"$f":"IF(F16=0,0,F19/F16)","v":0.42857142857142855},null,"Hondsberg (Rosmalen)"]
[null,"Wedstrijdpunten",null,null,null,{"$f":"SUM(H32:H57)","v":10}]
[null,"Saldopunten",null,null,null,{"$f":"SUM(I32:I57)","v":-13}]
[null,"Saldopunten per wedstrijd",null,null,null,{"$f":"IF(F16=0,0,F24/F16)","v":-1.8571428571428572}]
[]
[]
[null,"LET OP: alleen wedstrijden die daadwerkelijk gespeeld zijn in de wijk waarvoor jij je hebt ingeschreven tellen mee!"]
[]
[]
[null,"Datum","Locatie","UITSLAGEN",null,null,"W, V of G?","Wedstrijd-punten","Saldo-punten"]
[null,"2021-06-15","Hondsberg (Rosmalen)",9,"-",7,{"$f":"IF(OR($B$13=\"\",wijk_van_inschrijving=\"\"),\"-\",IF(OR(wijk_van_inschrijving<>C32,D32=\"\",F32=\"\"),\"-\",IF(D32>F32,\"W\",IF(D32=F32,\"G\",IF(D32<F32,\"V\",\"-\")))))","v":"W"},{"$f":"IF(OR($B$13=\"\",wijk_van_inschrijving=\"\"),\"-\",IF(OR(wijk_van_inschrijving<>C32,G32=\"-\",G32=\"\"),\"-\",IF(G32=\"W\",3,IF(G32=\"G\",2,IF(G32=\"V\",0,0)))))","v":3},{"$f":"IF(OR($B$13=\"\",wijk_van_inschrijving=\"\"),\"-\",IF(wijk_van_inschrijving<>C32,\"-\",IF(D32>=0,IF(F32=\"\",\"-\",D32-F32))))","v":2}]
[null,"2021-06-15","Hondsberg (Rosmalen)",6,"-",6,"G",2,0]
[null,"2021-06-15","Hondsberg (Rosmalen)",8,"-",8,"G",2,0]
[null,"2021-06-22","Hondsberg (Rosmalen)",2,"-",9,"V",0,-7]
[null,"2021-06-22","Hondsberg (Rosmalen)",5,"-",11,"V",0,-6]
[null,"2021-06-30","Hondsberg (Rosmalen)",11,"-",9,"W",3,2]
[null,"2021-06-30","Hondsberg (Rosmalen)",5,"-",9,"V",0,-4]
[null,null,null,null,"-",null,"-","-","-"]
[null,null,null,null,"-",null,"-","-","-"]
[null,null,null,null,"-",null,"-","-","-"]
[null,null,null,null,"-",null,"-","-","-"]
[null,null,null,null,"-",null,"-","-","-"]
[null,null,null,null,"-",null,"-","-","-"]
[null,null,null,null,"-",null,"-","-","-"]
[null,null,null,null,"-",null,"-","-","-"]
[null,null,null,null,"-",null,"-","-","-"]
[null,null,null,null,"-",null,"-","-","-"]
[null,null,null,null,"-",null,"-","-","-"]
[null,null,null,null,"-",null,"-","-","-"]
[null,null,null,null,"-",null,"-","-","-"]
[null,null,null,null,"-",null,"-","-","-"]
[null,null,null,null,"-",null,"-","-","-"]
[null,null,null,null,"-",null,"-","-","-"]
[null,null,null,null,"-",null,"-","-","-"]
[null,null,null,null,"-",null,"-","-","-"]

{"sheet":"Jürgen Cools","index":60,"n_rows":56,"n_cols":9,"rows_kept":56,"cut":false,"hidden":false,"merged":[[18,7,20,8],[30,3,30,5],[12,1,12,8],[15,1,15,4],[16,1,16,4],[17,1,17,4],[18,1,18,4],[19,1,19,4],[20,1,20,4],[21,1,21,4],[22,1,22,4],[23,1,23,4],[24,1,24,4],[21,7,21,8],[27,1,27,8]]}
[]
[]
[]
[]
[]
[]
[]
[]
[]
[]
[]
[]
[null,"Jürgen Cools"]
[]
[]
[null,"Gespeeld",null,null,null,{"$f":"COUNTIF(G32:G57,\"W\")+COUNTIF(G32:G57,\"G\")+COUNTIF(G32:G57,\"V\")","v":3}]
[null,"Gewonnen",null,null,null,{"$f":"COUNTIF(G32:G57,\"W\")","v":3}]
[null,"Gelijk",null,null,null,{"$f":"COUNTIF(G32:G57,\"G\")","v":0}]
[null,"Verloren",null,null,null,{"$f":"COUNTIF(G32:G57,\"V\")","v":0},null,"Wijk van initiële inschrijving\n(met shirtkleur finaledag)"]
[null,"% gewonnen",null,null,null,{"$f":"IF(F16=0,0,F17/F16)","v":1}]
[null,"% gelijk",null,null,null,{"$f":"IF(F16=0,0,F18/F16)","v":0}]
[null,"% verloren",null,null,null,{"$f":"IF(F16=0,0,F19/F16)","v":0},null,"De Schutskamp"]
[null,"Wedstrijdpunten",null,null,null,{"$f":"SUM(H32:H57)","v":9}]
[null,"Saldopunten",null,null,null,{"$f":"SUM(I32:I57)","v":25}]
[null,"Saldopunten per wedstrijd",null,null,null,{"$f":"IF(F16=0,0,F24/F16)","v":8.3333333333333339}]
[]
[]
[null,"LET OP: alleen wedstrijden die daadwerkelijk gespeeld zijn in de wijk waarvoor jij je hebt ingeschreven tellen mee!"]
[]
[]
[null,"Datum","Locatie","UITSLAGEN",null,null,"W, V of G?","Wedstrijd-punten","Saldo-punten"]
[null,"2021-06-14","De Schutskamp",7,"-",4,{"$f":"IF(OR($B$13=\"\",wijk_van_inschrijving=\"\"),\"-\",IF(OR(wijk_van_inschrijving<>C32,D32=\"\",F32=\"\"),\"-\",IF(D32>F32,\"W\",IF(D32=F32,\"G\",IF(D32<F32,\"V\",\"-\")))))","v":"W"},{"$f":"IF(OR($B$13=\"\",wijk_van_inschrijving=\"\"),\"-\",IF(OR(wijk_van_inschrijving<>C32,G32=\"-\",G32=\"\"),\"-\",IF(G32=\"W\",3,IF(G32=\"G\",2,IF(G32=\"V\",0,0)))))","v":3},{"$f":"IF(OR($B$13=\"\",wijk_van_inschrijving=\"\"),\"-\",IF(wijk_van_inschrijving<>C32,\"-\",IF(D32>=0,IF(F32=\"\",\"-\",D32-F32))))","v":3}]
[null,"2021-06-14","De Schutskamp",13,"-",0,"W",3,13]
[null,"2021-06-14","De Schutskamp",13,"-",4,"W",3,9]
[null,null,null,null,"-",null,"-","-","-"]
[null,null,null,null,"-",null,"-","-","-"]
[null,null,null,null,"-",null,"-","-","-"]
[null,null,null,null,"-",null,"-","-","-"]
[null,null,null,null,"-",null,"-","-","-"]
[null,null,null,null,"-",null,"-","-","-"]
[null,null,null,null,"-",null,"-","-","-"]
[null,null,null,null,"-",null,"-","-","-"]
[null,null,null,null,"-",null,"-","-","-"]
[null,null,null,null,"-",null,"-","-","-"]
[null,null,null,null,"-",null,"-","-","-"]
[null,null,null,null,"-",null,"-","-","-"]
[null,null,null,null,"-",null,"-","-","-"]
[null,null,null,null,"-",null,"-","-","-"]
[null,null,null,null,"-",null,"-","-","-"]
[null,null,null,null,"-",null,"-","-","-"]
[null,null,null,null,"-",null,"-","-","-"]
[null,null,null,null,"-",null,"-","-","-"]
[null,null,null,null,"-",null,"-","-","-"]
[null,null,null,null,"-",null,"-","-","-"]
[null,null,null,null,"-",null,"-","-","-"]
[null,null,null,null,"-",null,"-","-","-"]

{"sheet":"Lenie van Triest - Guijt","index":61,"n_rows":56,"n_cols":9,"rows_kept":56,"cut":false,"hidden":false,"merged":[[27,1,27,8],[30,3,30,5],[20,1,20,4],[21,7,21,8],[21,1,21,4],[22,1,22,4],[23,1,23,4],[24,1,24,4],[18,7,20,8],[19,1,19,4],[12,1,12,8],[15,1,15,4],[16,1,16,4],[17,1,17,4],[18,1,18,4]]}
[]
[]
[]
[]
[]
[]
[]
[]
[]
[]
[]
[]
[null,"Lenie van Triest - Guijt"]
[]
[]
[null,"Gespeeld",null,null,null,{"$f":"COUNTIF(G32:G57,\"W\")+COUNTIF(G32:G57,\"G\")+COUNTIF(G32:G57,\"V\")","v":7}]
[null,"Gewonnen",null,null,null,{"$f":"COUNTIF(G32:G57,\"W\")","v":3}]
[null,"Gelijk",null,null,null,{"$f":"COUNTIF(G32:G57,\"G\")","v":0}]
[null,"Verloren",null,null,null,{"$f":"COUNTIF(G32:G57,\"V\")","v":4},null,"Wijk van initiële inschrijving\n(met shirtkleur finaledag)"]
[null,"% gewonnen",null,null,null,{"$f":"IF(F16=0,0,F17/F16)","v":0.42857142857142855}]
[null,"% gelijk",null,null,null,{"$f":"IF(F16=0,0,F18/F16)","v":0}]
[null,"% verloren",null,null,null,{"$f":"IF(F16=0,0,F19/F16)","v":0.5714285714285714},null,"Hondsberg (Rosmalen)"]
[null,"Wedstrijdpunten",null,null,null,{"$f":"SUM(H32:H57)","v":9}]
[null,"Saldopunten",null,null,null,{"$f":"SUM(I32:I57)","v":-22}]
[null,"Saldopunten per wedstrijd",null,null,null,{"$f":"IF(F16=0,0,F24/F16)","v":-3.1428571428571428}]
[]
[]
[null,"LET OP: alleen wedstrijden die daadwerkelijk gespeeld zijn in de wijk waarvoor jij je hebt ingeschreven tellen mee!"]
[]
[]
[null,"Datum","Locatie","UITSLAGEN",null,null,"W, V of G?","Wedstrijd-punten","Saldo-punten"]
[null,"2021-06-22","Hondsberg (Rosmalen)",4,"-",10,{"$f":"IF(OR($B$13=\"\",wijk_van_inschrijving=\"\"),\"-\",IF(OR(wijk_van_inschrijving<>C32,D32=\"\",F32=\"\"),\"-\",IF(D32>F32,\"W\",IF(D32=F32,\"G\",IF(D32<F32,\"V\",\"-\")))))","v":"V"},{"$f":"IF(OR($B$13=\"\",wijk_van_inschrijving=\"\"),\"-\",IF(OR(wijk_van_inschrijving<>C32,G32=\"-\",G32=\"\"),\"-\",IF(G32=\"W\",3,IF(G32=\"G\",2,IF(G32=\"V\",0,0)))))","v":0},{"$f":"IF(OR($B$13=\"\",wijk_van_inschrijving=\"\"),\"-\",IF(wijk_van_inschrijving<>C32,\"-\",IF(D32>=0,IF(F32=\"\",\"-\",D32-F32))))","v":-6}]
[null,"2021-06-22","Hondsberg (Rosmalen)",5,"-",11,"V",0,-6]
[null,"2021-06-30","Hondsberg (Rosmalen)",6,"-",3,"W",3,3]
[null,"2021-06-30","Hondsberg (Rosmalen)",0,"-",12,"V",0,-12]
[null,"2021-07-07","Hondsberg (Rosmalen)",5,"-",3,"W",3,2]
[null,"2021-07-07","Hondsberg (Rosmalen)",2,"-",11,"V",0,-9]
[null,"2021-07-07","Hondsberg (Rosmalen)",7,"-",1,"W",3,6]
[null,null,null,null,"-",null,"-","-","-"]
[null,null,null,null,"-",null,"-","-","-"]
[null,null,null,null,"-",null,"-","-","-"]
[null,null,null,null,"-",null,"-","-","-"]
[null,null,null,null,"-",null,"-","-","-"]
[null,null,null,null,"-",null,"-","-","-"]
[null,null,null,null,"-",null,"-","-","-"]
[null,null,null,null,"-",null,"-","-","-"]
[null,null,null,null,"-",null,"-","-","-"]
[null,null,null,null,"-",null,"-","-","-"]
[null,null,null,null,"-",null,"-","-","-"]
[null,null,null,null,"-",null,"-","-","-"]
[null,null,null,null,"-",null,"-","-","-"]
[null,null,null,null,"-",null,"-","-","-"]
[null,null,null,null,"-",null,"-","-","-"]
[null,null,null,null,"-",null,"-","-","-"]
[null,null,null,null,"-",null,"-","-","-"]
[null,null,null,null,"-",null,"-","-","-"]

{"sheet":"Leo Leenders","index":62,"n_rows":56,"n_cols":9,"rows_kept":56,"cut":false,"hidden":false,"merged":[[18,7,20,8],[30,3,30,5],[12,1,12,8],[15,1,15,4],[16,1,16,4],[17,1,17,4],[18,1,18,4],[19,1,19,4],[20,1,20,4],[21,1,21,4],[22,1,22,4],[23,1,23,4],[24,1,24,4],[21,7,21,8],[27,1,27,8]]}
[]
[]
[]
[]
[]
[]
[]
[]
[]
[]
[]
[]
[null,"Leo Leenders"]
[]
[]
[null,"Gespeeld",null,null,null,{"$f":"COUNTIF(G32:G57,\"W\")+COUNTIF(G32:G57,\"G\")+COUNTIF(G32:G57,\"V\")","v":3}]
[null,"Gewonnen",null,null,null,{"$f":"COUNTIF(G32:G57,\"W\")","v":3}]
[null,"Gelijk",null,null,null,{"$f":"COUNTIF(G32:G57,\"G\")","v":0}]
[null,"Verloren",null,null,null,{"$f":"COUNTIF(G32:G57,\"V\")","v":0},null,"Wijk van initiële inschrijving\n(met shirtkleur finaledag)"]
[null,"% gewonnen",null,null,null,{"$f":"IF(F16=0,0,F17/F16)","v":1}]
[null,"% gelijk",null,null,null,{"$f":"IF(F16=0,0,F18/F16)","v":0}]
[null,"% verloren",null,null,null,{"$f":"IF(F16=0,0,F19/F16)","v":0},null,"De Schutskamp"]
[null,"Wedstrijdpunten",null,null,null,{"$f":"SUM(H32:H57)","v":9}]
[null,"Saldopunten",null,null,null,{"$f":"SUM(I32:I57)","v":19}]
[null,"Saldopunten per wedstrijd",null,null,null,{"$f":"IF(F16=0,0,F24/F16)","v":6.333333333333333}]
[]
[]
[null,"LET OP: alleen wedstrijden die daadwerkelijk gespeeld zijn in de wijk waarvoor jij je hebt ingeschreven tellen mee!"]
[]
[]
[null,"Datum","Locatie","UITSLAGEN",null,null,"W, V of G?","Wedstrijd-punten","Saldo-punten"]
[null,"2021-06-14","De Schutskamp",13,"-",3,{"$f":"IF(OR($B$13=\"\",wijk_van_inschrijving=\"\"),\"-\",IF(OR(wijk_van_inschrijving<>C32,D32=\"\",F32=\"\"),\"-\",IF(D32>F32,\"W\",IF(D32=F32,\"G\",IF(D32<F32,\"V\",\"-\")))))","v":"W"},{"$f":"IF(OR($B$13=\"\",wijk_van_inschrijving=\"\"),\"-\",IF(OR(wijk_van_inschrijving<>C32,G32=\"-\",G32=\"\"),\"-\",IF(G32=\"W\",3,IF(G32=\"G\",2,IF(G32=\"V\",0,0)))))","v":3},{"$f":"IF(OR($B$13=\"\",wijk_van_inschrijving=\"\"),\"-\",IF(wijk_van_inschrijving<>C32,\"-\",IF(D32>=0,IF(F32=\"\",\"-\",D32-F32))))","v":10}]
[null,"2021-06-14","De Schutskamp",4,"-",3,"W",3,1]
[null,"2021-06-14","De Schutskamp",13,"-",5,"W",3,8]
[null,null,null,null,"-",null,"-","-","-"]
[null,null,null,null,"-",null,"-","-","-"]
[null,null,null,null,"-",null,"-","-","-"]
[null,null,null,null,"-",null,"-","-","-"]
[null,null,null,null,"-",null,"-","-","-"]
[null,null,null,null,"-",null,"-","-","-"]
[null,null,null,null,"-",null,"-","-","-"]
[null,null,null,null,"-",null,"-","-","-"]
[null,null,null,null,"-",null,"-","-","-"]
[null,null,null,null,"-",null,"-","-","-"]
[null,null,null,null,"-",null,"-","-","-"]
[null,null,null,null,"-",null,"-","-","-"]
[null,null,null,null,"-",null,"-","-","-"]
[null,null,null,null,"-",null,"-","-","-"]
[null,null,null,null,"-",null,"-","-","-"]
[null,null,null,null,"-",null,"-","-","-"]
[null,null,null,null,"-",null,"-","-","-"]
[null,null,null,null,"-",null,"-","-","-"]
[null,null,null,null,"-",null,"-","-","-"]
[null,null,null,null,"-",null,"-","-","-"]
[null,null,null,null,"-",null,"-","-","-"]
[null,null,null,null,"-",null,"-","-","-"]

{"sheet":"Lia Jansen","index":63,"n_rows":56,"n_cols":9,"rows_kept":56,"cut":false,"hidden":false,"merged":[[27,1,27,8],[30,3,30,5],[20,1,20,4],[21,7,21,8],[21,1,21,4],[22,1,22,4],[23,1,23,4],[24,1,24,4],[18,7,20,8],[19,1,19,4],[12,1,12,8],[15,1,15,4],[16,1,16,4],[17,1,17,4],[18,1,18,4]]}
[]
[]
[]
[]
[]
[]
[]
[]
[]
[]
[]
[]
[null,"Lia Jansen"]
[]
[]
[null,"Gespeeld",null,null,null,{"$f":"COUNTIF(G32:G57,\"W\")+COUNTIF(G32:G57,\"G\")+COUNTIF(G32:G57,\"V\")","v":7}]
[null,"Gewonnen",null,null,null,{"$f":"COUNTIF(G32:G57,\"W\")","v":3}]
[null,"Gelijk",null,null,null,{"$f":"COUNTIF(G32:G57,\"G\")","v":0}]
[null,"Verloren",null,null,null,{"$f":"COUNTIF(G32:G57,\"V\")","v":4},null,"Wijk van initiële inschrijving\n(met shirtkleur finaledag)"]
[null,"% gewonnen",null,null,null,{"$f":"IF(F16=0,0,F17/F16)","v":0.42857142857142855}]
[null,"% gelijk",null,null,null,{"$f":"IF(F16=0,0,F18/F16)","v":0}]
[null,"% verloren",null,null,null,{"$f":"IF(F16=0,0,F19/F16)","v":0.5714285714285714},null,"Hondsberg (Rosmalen)"]
[null,"Wedstrijdpunten",null,null,null,{"$f":"SUM(H32:H57)","v":9}]
[null,"Saldopunten",null,null,null,{"$f":"SUM(I32:I57)","v":1}]
[null,"Saldopunten per wedstrijd",null,null,null,{"$f":"IF(F16=0,0,F24/F16)","v":0.14285714285714285}]
[]
[]
[null,"LET OP: alleen wedstrijden die daadwerkelijk gespeeld zijn in de wijk waarvoor jij je hebt ingeschreven tellen mee!"]
[]
[]
[null,"Datum","Locatie","UITSLAGEN",null,null,"W, V of G?","Wedstrijd-punten","Saldo-punten"]
[null,"2021-06-22","Hondsberg (Rosmalen)",10,"-",4,{"$f":"IF(OR($B$13=\"\",wijk_van_inschrijving=\"\"),\"-\",IF(OR(wijk_van_inschrijving<>C32,D32=\"\",F32=\"\"),\"-\",IF(D32>F32,\"W\",IF(D32=F32,\"G\",IF(D32<F32,\"V\",\"-\")))))","v":"W"},{"$f":"IF(OR($B$13=\"\",wijk_van_inschrijving=\"\"),\"-\",IF(OR(wijk_van_inschrijving<>C32,G32=\"-\",G32=\"\"),\"-\",IF(G32=\"W\",3,IF(G32=\"G\",2,IF(G32=\"V\",0,0)))))","v":3},{"$f":"IF(OR($B$13=\"\",wijk_van_inschrijving=\"\"),\"-\",IF(wijk_van_inschrijving<>C32,\"-\",IF(D32>=0,IF(F32=\"\",\"-\",D32-F32))))","v":6}]
[null,"2021-06-22","Hondsberg (Rosmalen)",6,"-",13,"V",0,-7]
[null,"2021-06-30","Hondsberg (Rosmalen)",13,"-",5,"W",3,8]
[null,"2021-06-30","Hondsberg (Rosmalen)",5,"-",9,"V",0,-4]
[null,"2021-07-07","Hondsberg (Rosmalen)",3,"-",5,"V",0,-2]
[null,"2021-07-07","Hondsberg (Rosmalen)",3,"-",11,"V",0,-8]
[null,"2021-07-07","Hondsberg (Rosmalen)",11,"-",3,"W",3,8]
[null,null,null,null,"-",null,"-","-","-"]
[null,null,null,null,"-",null,"-","-","-"]
[null,null,null,null,"-",null,"-","-","-"]
[null,null,null,null,"-",null,"-","-","-"]
[null,null,null,null,"-",null,"-","-","-"]
[null,null,null,null,"-",null,"-","-","-"]
[null,null,null,null,"-",null,"-","-","-"]
[null,null,null,null,"-",null,"-","-","-"]
[null,null,null,null,"-",null,"-","-","-"]
[null,null,null,null,"-",null,"-","-","-"]
[null,null,null,null,"-",null,"-","-","-"]
[null,null,null,null,"-",null,"-","-","-"]
[null,null,null,null,"-",null,"-","-","-"]
[null,null,null,null,"-",null,"-","-","-"]
[null,null,null,null,"-",null,"-","-","-"]
[null,null,null,null,"-",null,"-","-","-"]
[null,null,null,null,"-",null,"-","-","-"]
[null,null,null,null,"-",null,"-","-","-"]

{"sheet":"Loek Zweekhorst","index":64,"n_rows":56,"n_cols":9,"rows_kept":56,"cut":false,"hidden":false,"merged":[[27,1,27,8],[30,3,30,5],[20,1,20,4],[21,7,21,8],[21,1,21,4],[22,1,22,4],[23,1,23,4],[24,1,24,4],[18,7,20,8],[19,1,19,4],[12,1,12,8],[15,1,15,4],[16,1,16,4],[17,1,17,4],[18,1,18,4]]}
[]
[]
[]
[]
[]
[]
[]
[]
[]
[]
[]
[]
[null,"Loek Zweekhorst"]
[]
[]
[null,"Gespeeld",null,null,null,{"$f":"COUNTIF(G32:G57,\"W\")+COUNTIF(G32:G57,\"G\")+COUNTIF(G32:G57,\"V\")","v":5}]
[null,"Gewonnen",null,null,null,{"$f":"COUNTIF(G32:G57,\"W\")","v":3}]
[null,"Gelijk",null,null,null,{"$f":"COUNTIF(G32:G57,\"G\")","v":0}]
[null,"Verloren",null,null,null,{"$f":"COUNTIF(G32:G57,\"V\")","v":2},null,"Wijk van initiële inschrijving\n(met shirtkleur finaledag)"]
[null,"% gewonnen",null,null,null,{"$f":"IF(F16=0,0,F17/F16)","v":0.6}]
[null,"% gelijk",null,null,null,{"$f":"IF(F16=0,0,F18/F16)","v":0}]
[null,"% verloren",null,null,null,{"$f":"IF(F16=0,0,F19/F16)","v":0.4},null,"Hondsberg (Rosmalen)"]
[null,"Wedstrijdpunten",null,null,null,{"$f":"SUM(H32:H57)","v":9}]
[null,"Saldopunten",null,null,null,{"$f":"SUM(I32:I57)","v":2}]
[null,"Saldopunten per wedstrijd",null,null,null,{"$f":"IF(F16=0,0,F24/F16)","v":0.4}]
[]
[]
[null,"LET OP: alleen wedstrijden die daadwerkelijk gespeeld zijn in de wijk waarvoor jij je hebt ingeschreven tellen mee!"]
[]
[]
[null,"Datum","Locatie","UITSLAGEN",null,null,"W, V of G?","Wedstrijd-punten","Saldo-punten"]
[null,"2021-06-30","Hondsberg (Rosmalen)",6,"-",3,{"$f":"IF(OR($B$13=\"\",wijk_van_inschrijving=\"\"),\"-\",IF(OR(wijk_van_inschrijving<>C32,D32=\"\",F32=\"\"),\"-\",IF(D32>F32,\"W\",IF(D32=F32,\"G\",IF(D32<F32,\"V\",\"-\")))))","v":"W"},{"$f":"IF(OR($B$13=\"\",wijk_van_inschrijving=\"\"),\"-\",IF(OR(wijk_van_inschrijving<>C32,G32=\"-\",G32=\"\"),\"-\",IF(G32=\"W\",3,IF(G32=\"G\",2,IF(G32=\"V\",0,0)))))","v":3},{"$f":"IF(OR($B$13=\"\",wijk_van_inschrijving=\"\"),\"-\",IF(wijk_van_inschrijving<>C32,\"-\",IF(D32>=0,IF(F32=\"\",\"-\",D32-F32))))","v":3}]
[null,"2021-06-30","Hondsberg (Rosmalen)",9,"-",5,"W",3,4]
[null,"2021-07-07","Hondsberg (Rosmalen)",3,"-",5,"V",0,-2]
[null,"2021-07-07","Hondsberg (Rosmalen)",6,"-",10,"V",0,-4]
[null,"2021-07-07","Hondsberg (Rosmalen)",6,"-",5,"W",3,1]
[null,null,null,null,"-",null,"-","-","-"]
[null,null,null,null,"-",null,"-","-","-"]
[null,null,null,null,"-",null,"-","-","-"]
[null,null,null,null,"-",null,"-","-","-"]
[null,null,null,null,"-",null,"-","-","-"]
[null,null,null,null,"-",null,"-","-","-"]
[null,null,null,null,"-",null,"-","-","-"]
[null,null,null,null,"-",null,"-","-","-"]
[null,null,null,null,"-",null,"-","-","-"]
[null,null,null,null,"-",null,"-","-","-"]
[null,null,null,null,"-",null,"-","-","-"]
[null,null,null,null,"-",null,"-","-","-"]
[null,null,null,null,"-",null,"-","-","-"]
[null,null,null,null,"-",null,"-","-","-"]
[null,null,null,null,"-",null,"-","-","-"]
[null,null,null,null,"-",null,"-","-","-"]
[null,null,null,null,"-",null,"-","-","-"]
[null,null,null,null,"-",null,"-","-","-"]
[null,null,null,null,"-",null,"-","-","-"]
[null,null,null,null,"-",null,"-","-","-"]

{"sheet":"Maik van Zutphen","index":65,"n_rows":56,"n_cols":9,"rows_kept":56,"cut":false,"hidden":false,"merged":[[27,1,27,8],[30,3,30,5],[20,1,20,4],[21,7,21,8],[21,1,21,4],[22,1,22,4],[23,1,23,4],[24,1,24,4],[18,7,20,8],[19,1,19,4],[12,1,12,8],[15,1,15,4],[16,1,16,4],[17,1,17,4],[18,1,18,4]]}
[]
[]
[]
[]
[]
[]
[]
[]
[]
[]
[]
[]
[null,"Maik van Zutphen"]
[]
[]
[null,"Gespeeld",null,null,null,{"$f":"COUNTIF(G32:G57,\"W\")+COUNTIF(G32:G57,\"G\")+COUNTIF(G32:G57,\"V\")","v":3}]
[null,"Gewonnen",null,null,null,{"$f":"COUNTIF(G32:G57,\"W\")","v":0}]
[null,"Gelijk",null,null,null,{"$f":"COUNTIF(G32:G57,\"G\")","v":0}]
[null,"Verloren",null,null,null,{"$f":"COUNTIF(G32:G57,\"V\")","v":3},null,"Wijk van initiële inschrijving\n(met shirtkleur finaledag)"]
[null,"% gewonnen",null,null,null,{"$f":"IF(F16=0,0,F17/F16)","v":0}]
[null,"% gelijk",null,null,null,{"$f":"IF(F16=0,0,F18/F16)","v":0}]
[null,"% verloren",null,null,null,{"$f":"IF(F16=0,0,F19/F16)","v":1},null,"De Schutskamp"]
[null,"Wedstrijdpunten",null,null,null,{"$f":"SUM(H32:H57)","v":0}]
[null,"Saldopunten",null,null,null,{"$f":"SUM(I32:I57)","v":-12}]
[null,"Saldopunten per wedstrijd",null,null,null,{"$f":"IF(F16=0,0,F24/F16)","v":-4}]
[]
[]
[null,"LET OP: alleen wedstrijden die daadwerkelijk gespeeld zijn in de wijk waarvoor jij je hebt ingeschreven tellen mee!"]
[]
[]
[null,"Datum","Locatie","UITSLAGEN",null,null,"W, V of G?","Wedstrijd-punten","Saldo-punten"]
[null,"2021-06-24","De Schutskamp",7,"-",11,{"$f":"IF(OR($B$13=\"\",wijk_van_inschrijving=\"\"),\"-\",IF(OR(wijk_van_inschrijving<>C32,D32=\"\",F32=\"\"),\"-\",IF(D32>F32,\"W\",IF(D32=F32,\"G\",IF(D32<F32,\"V\",\"-\")))))","v":"V"},{"$f":"IF(OR($B$13=\"\",wijk_van_inschrijving=\"\"),\"-\",IF(OR(wijk_van_inschrijving<>C32,G32=\"-\",G32=\"\"),\"-\",IF(G32=\"W\",3,IF(G32=\"G\",2,IF(G32=\"V\",0,0)))))","v":0},{"$f":"IF(OR($B$13=\"\",wijk_van_inschrijving=\"\"),\"-\",IF(wijk_van_inschrijving<>C32,\"-\",IF(D32>=0,IF(F32=\"\",\"-\",D32-F32))))","v":-4}]
[null,"2021-06-24","De Schutskamp",5,"-",10,"V",0,-5]
[null,"2021-06-24","De Schutskamp",7,"-",10,"V",0,-3]
[null,null,null,null,"-",null,"-","-","-"]
[null,null,null,null,"-",null,"-","-","-"]
[null,null,null,null,"-",null,"-","-","-"]
[null,null,null,null,"-",null,"-","-","-"]
[null,null,null,null,"-",null,"-","-","-"]
[null,null,null,null,"-",null,"-","-","-"]
[null,null,null,null,"-",null,"-","-","-"]
[null,null,null,null,"-",null,"-","-","-"]
[null,null,null,null,"-",null,"-","-","-"]
[null,null,null,null,"-",null,"-","-","-"]
[null,null,null,null,"-",null,"-","-","-"]
[null,null,null,null,"-",null,"-","-","-"]
[null,null,null,null,"-",null,"-","-","-"]
[null,null,null,null,"-",null,"-","-","-"]
[null,null,null,null,"-",null,"-","-","-"]
[null,null,null,null,"-",null,"-","-","-"]
[null,null,null,null,"-",null,"-","-","-"]
[null,null,null,null,"-",null,"-","-","-"]
[null,null,null,null,"-",null,"-","-","-"]
[null,null,null,null,"-",null,"-","-","-"]
[null,null,null,null,"-",null,"-","-","-"]
[null,null,null,null,"-",null,"-","-","-"]

{"sheet":"Mari van Kessel","index":66,"n_rows":56,"n_cols":9,"rows_kept":56,"cut":false,"hidden":false,"merged":[[18,7,20,8],[30,3,30,5],[12,1,12,8],[15,1,15,4],[16,1,16,4],[17,1,17,4],[18,1,18,4],[19,1,19,4],[20,1,20,4],[21,1,21,4],[22,1,22,4],[23,1,23,4],[24,1,24,4],[21,7,21,8],[27,1,27,8]]}
[]
[]
[]
[]
[]
[]
[]
[]
[]
[]
[]
[]
[null,"Mari van Kessel"]
[]
[]
[null,"Gespeeld",null,null,null,{"$f":"COUNTIF(G32:G57,\"W\")+COUNTIF(G32:G57,\"G\")+COUNTIF(G32:G57,\"V\")","v":12}]
[null,"Gewonnen",null,null,null,{"$f":"COUNTIF(G32:G57,\"W\")","v":4}]
[null,"Gelijk",null,null,null,{"$f":"COUNTIF(G32:G57,\"G\")","v":1}]
[null,"Verloren",null,null,null,{"$f":"COUNTIF(G32:G57,\"V\")","v":7},null,"Wijk van initiële inschrijving\n(met shirtkleur finaledag)"]
[null,"% gewonnen",null,null,null,{"$f":"IF(F16=0,0,F17/F16)","v":0.33333333333333331}]
[null,"% gelijk",null,null,null,{"$f":"IF(F16=0,0,F18/F16)","v":8.3333333333333329E-2}]
[null,"% verloren",null,null,null,{"$f":"IF(F16=0,0,F19/F16)","v":0.58333333333333337},null,"'s-Hertogenbosch Zuid"]
[null,"Wedstrijdpunten",null,null,null,{"$f":"SUM(H32:H57)","v":14}]
[null,"Saldopunten",null,null,null,{"$f":"SUM(I32:I57)","v":6}]
[null,"Saldopunten per wedstrijd",null,null,null,{"$f":"IF(F16=0,0,F24/F16)","v":0.5}]
[]
[]
[null,"LET OP: alleen wedstrijden die daadwerkelijk gespeeld zijn in de wijk waarvoor jij je hebt ingeschreven tellen mee!"]
[]
[]
[null,"Datum","Locatie","UITSLAGEN",null,null,"W, V of G?","Wedstrijd-punten","Saldo-punten"]
[null,"2021-06-18","'s-Hertogenbosch Zuid",13,"-",1,{"$f":"IF(OR($B$13=\"\",wijk_van_inschrijving=\"\"),\"-\",IF(OR(wijk_van_inschrijving<>C32,D32=\"\",F32=\"\"),\"-\",IF(D32>F32,\"W\",IF(D32=F32,\"G\",IF(D32<F32,\"V\",\"-\")))))","v":"W"},{"$f":"IF(OR($B$13=\"\",wijk_van_inschrijving=\"\"),\"-\",IF(OR(wijk_van_inschrijving<>C32,G32=\"-\",G32=\"\"),\"-\",IF(G32=\"W\",3,IF(G32=\"G\",2,IF(G32=\"V\",0,0)))))","v":3},{"$f":"IF(OR($B$13=\"\",wijk_van_inschrijving=\"\"),\"-\",IF(wijk_van_inschrijving<>C32,\"-\",IF(D32>=0,IF(F32=\"\",\"-\",D32-F32))))","v":12}]
[null,"2021-06-18","'s-Hertogenbosch Zuid",5,"-",7,"V",0,-2]
[null,"2021-06-18","'s-Hertogenbosch Zuid",13,"-",2,"W",3,11]
[null,"2021-06-25","'s-Hertogenbosch Zuid",5,"-",9,"V",0,-4]
[null,"2021-06-25","'s-Hertogenbosch Zuid",13,"-",0,"W",3,13]
[null,"2021-06-25","'s-Hertogenbosch Zuid",4,"-",13,"V",0,-9]
[null,"2021-07-01","'s-Hertogenbosch Zuid",7,"-",7,"G",2,0]
[null,"2021-07-01","'s-Hertogenbosch Zuid",3,"-",11,"V",0,-8]
[null,"2021-07-01","'s-Hertogenbosch Zuid",8,"-",13,"V",0,-5]
[null,"2021-07-08","'s-Hertogenbosch Zuid",5,"-",13,"V",0,-8]
[null,"2021-07-08","'s-Hertogenbosch Zuid",13,"-",1,"W",3,12]
[null,"2021-07-08","'s-Hertogenbosch Zuid",7,"-",13,"V",0,-6]
[null,null,null,null,"-",null,"-","-","-"]
[null,null,null,null,"-",null,"-","-","-"]
[null,null,null,null,"-",null,"-","-","-"]
[null,null,null,null,"-",null,"-","-","-"]
[null,null,null,null,"-",null,"-","-","-"]
[null,null,null,null,"-",null,"-","-","-"]
[null,null,null,null,"-",null,"-","-","-"]
[null,null,null,null,"-",null,"-","-","-"]
[null,null,null,null,"-",null,"-","-","-"]
[null,null,null,null,"-",null,"-","-","-"]
[null,null,null,null,"-",null,"-","-","-"]
[null,null,null,null,"-",null,"-","-","-"]
[null,null,null,null,"-",null,"-","-","-"]

{"sheet":"Maria de Zwart","index":67,"n_rows":56,"n_cols":9,"rows_kept":56,"cut":false,"hidden":false,"merged":[[18,7,20,8],[30,3,30,5],[12,1,12,8],[15,1,15,4],[16,1,16,4],[17,1,17,4],[18,1,18,4],[19,1,19,4],[20,1,20,4],[21,1,21,4],[22,1,22,4],[23,1,23,4],[24,1,24,4],[21,7,21,8],[27,1,27,8]]}
[]
[]
[]
[]
[]
[]
[]
[]
[]
[]
[]
[]
[null,"Maria de Zwart"]
[]
[]
[null,"Gespeeld",null,null,null,{"$f":"COUNTIF(G32:G57,\"W\")+COUNTIF(G32:G57,\"G\")+COUNTIF(G32:G57,\"V\")","v":10}]
[null,"Gewonnen",null,null,null,{"$f":"COUNTIF(G32:G57,\"W\")","v":6}]
[null,"Gelijk",null,null,null,{"$f":"COUNTIF(G32:G57,\"G\")","v":0}]
[null,"Verloren",null,null,null,{"$f":"COUNTIF(G32:G57,\"V\")","v":4},null,"Wijk van initiële inschrijving\n(met shirtkleur finaledag)"]
[null,"% gewonnen",null,null,null,{"$f":"IF(F16=0,0,F17/F16)","v":0.6}]
[null,"% gelijk",null,null,null,{"$f":"IF(F16=0,0,F18/F16)","v":0}]
[null,"% verloren",null,null,null,{"$f":"IF(F16=0,0,F19/F16)","v":0.4},null,"Hondsberg (Rosmalen)"]
[null,"Wedstrijdpunten",null,null,null,{"$f":"SUM(H32:H57)","v":18}]
[null,"Saldopunten",null,null,null,{"$f":"SUM(I32:I57)","v":17}]
[null,"Saldopunten per wedstrijd",null,null,null,{"$f":"IF(F16=0,0,F24/F16)","v":1.7}]
[]
[]
[null,"LET OP: alleen wedstrijden die daadwerkelijk gespeeld zijn in de wijk waarvoor jij je hebt ingeschreven tellen mee!"]
[]
[]
[null,"Datum","Locatie","UITSLAGEN",null,null,"W, V of G?","Wedstrijd-punten","Saldo-punten"]
[null,"2021-06-15","Hondsberg (Rosmalen)",12,"-",2,{"$f":"IF(OR($B$13=\"\",wijk_van_inschrijving=\"\"),\"-\",IF(OR(wijk_van_inschrijving<>C32,D32=\"\",F32=\"\"),\"-\",IF(D32>F32,\"W\",IF(D32=F32,\"G\",IF(D32<F32,\"V\",\"-\")))))","v":"W"},{"$f":"IF(OR($B$13=\"\",wijk_van_inschrijving=\"\"),\"-\",IF(OR(wijk_van_inschrijving<>C32,G32=\"-\",G32=\"\"),\"-\",IF(G32=\"W\",3,IF(G32=\"G\",2,IF(G32=\"V\",0,0)))))","v":3},{"$f":"IF(OR($B$13=\"\",wijk_van_inschrijving=\"\"),\"-\",IF(wijk_van_inschrijving<>C32,\"-\",IF(D32>=0,IF(F32=\"\",\"-\",D32-F32))))","v":10}]
[null,"2021-06-15","Hondsberg (Rosmalen)",8,"-",5,"W",3,3]
[null,"2021-06-15","Hondsberg (Rosmalen)",13,"-",6,"W",3,7]
[null,"2021-06-22","Hondsberg (Rosmalen)",2,"-",11,"V",0,-9]
[null,"2021-06-22","Hondsberg (Rosmalen)",11,"-",5,"W",3,6]
[null,"2021-06-30","Hondsberg (Rosmalen)",2,"-",13,"V",0,-11]
[null,"2021-06-30","Hondsberg (Rosmalen)",6,"-",7,"V",0,-1]
[null,"2021-07-07","Hondsberg (Rosmalen)",3,"-",5,"V",0,-2]
[null,"2021-07-07","Hondsberg (Rosmalen)",11,"-",3,"W",3,8]
[null,"2021-07-07","Hondsberg (Rosmalen)",7,"-",1,"W",3,6]
[null,null,null,null,"-",null,"-","-","-"]
[null,null,null,null,"-",null,"-","-","-"]
[null,null,null,null,"-",null,"-","-","-"]
[null,null,null,null,"-",null,"-","-","-"]
[null,null,null,null,"-",null,"-","-","-"]
[null,null,null,null,"-",null,"-","-","-"]
[null,null,null,null,"-",null,"-","-","-"]
[null,null,null,null,"-",null,"-","-","-"]
[null,null,null,null,"-",null,"-","-","-"]
[null,null,null,null,"-",null,"-","-","-"]
[null,null,null,null,"-",null,"-","-","-"]
[null,null,null,null,"-",null,"-","-","-"]
[null,null,null,null,"-",null,"-","-","-"]
[null,null,null,null,"-",null,"-","-","-"]
[null,null,null,null,"-",null,"-","-","-"]

{"sheet":"Maria Grove","index":68,"n_rows":56,"n_cols":9,"rows_kept":56,"cut":false,"hidden":false,"merged":[[18,7,20,8],[30,3,30,5],[12,1,12,8],[15,1,15,4],[16,1,16,4],[17,1,17,4],[18,1,18,4],[19,1,19,4],[20,1,20,4],[21,1,21,4],[22,1,22,4],[23,1,23,4],[24,1,24,4],[21,7,21,8],[27,1,27,8]]}
[]
[]
[]
[]
[]
[]
[]
[]
[]
[]
[]
[]
[null,"Maria Grove"]
[]
[]
[null,"Gespeeld",null,null,null,{"$f":"COUNTIF(G32:G57,\"W\")+COUNTIF(G32:G57,\"G\")+COUNTIF(G32:G57,\"V\")","v":6}]
[null,"Gewonnen",null,null,null,{"$f":"COUNTIF(G32:G57,\"W\")","v":1}]
[null,"Gelijk",null,null,null,{"$f":"COUNTIF(G32:G57,\"G\")","v":0}]
[null,"Verloren",null,null,null,{"$f":"COUNTIF(G32:G57,\"V\")","v":5},null,"Wijk van initiële inschrijving\n(met shirtkleur finaledag)"]
[null,"% gewonnen",null,null,null,{"$f":"IF(F16=0,0,F17/F16)","v":0.16666666666666666}]
[null,"% gelijk",null,null,null,{"$f":"IF(F16=0,0,F18/F16)","v":0}]
[null,"% verloren",null,null,null,{"$f":"IF(F16=0,0,F19/F16)","v":0.83333333333333337},null,"De Schutskamp"]
[null,"Wedstrijdpunten",null,null,null,{"$f":"SUM(H32:H57)","v":3}]
[null,"Saldopunten",null,null,null,{"$f":"SUM(I32:I57)","v":-22}]
[null,"Saldopunten per wedstrijd",null,null,null,{"$f":"IF(F16=0,0,F24/F16)","v":-3.6666666666666665}]
[]
[]
[null,"LET OP: alleen wedstrijden die daadwerkelijk gespeeld zijn in de wijk waarvoor jij je hebt ingeschreven tellen mee!"]
[]
[]
[null,"Datum","Locatie","UITSLAGEN",null,null,"W, V of G?","Wedstrijd-punten","Saldo-punten"]
[null,"2021-06-14","De Schutskamp",2,"-",13,{"$f":"IF(OR($B$13=\"\",wijk_van_inschrijving=\"\"),\"-\",IF(OR(wijk_van_inschrijving<>C32,D32=\"\",F32=\"\"),\"-\",IF(D32>F32,\"W\",IF(D32=F32,\"G\",IF(D32<F32,\"V\",\"-\")))))","v":"V"},{"$f":"IF(OR($B$13=\"\",wijk_van_inschrijving=\"\"),\"-\",IF(OR(wijk_van_inschrijving<>C32,G32=\"-\",G32=\"\"),\"-\",IF(G32=\"W\",3,IF(G32=\"G\",2,IF(G32=\"V\",0,0)))))","v":0},{"$f":"IF(OR($B$13=\"\",wijk_van_inschrijving=\"\"),\"-\",IF(wijk_van_inschrijving<>C32,\"-\",IF(D32>=0,IF(F32=\"\",\"-\",D32-F32))))","v":-11}]
[null,"2021-06-14","De Schutskamp",1,"-",8,"V",0,-7]
[null,"2021-06-14","De Schutskamp",2,"-",13,"V",0,-11]
[null,"2021-07-05","De Schutskamp",5,"-",7,"V",0,-2]
[null,"2021-07-05","De Schutskamp",13,"-",2,"W",3,11]
[null,"2021-07-05","De Schutskamp",6,"-",8,"V",0,-2]
[null,null,null,null,"-",null,"-","-","-"]
[null,null,null,null,"-",null,"-","-","-"]
[null,null,null,null,"-",null,"-","-","-"]
[null,null,null,null,"-",null,"-","-","-"]
[null,null,null,null,"-",null,"-","-","-"]
[null,null,null,null,"-",null,"-","-","-"]
[null,null,null,null,"-",null,"-","-","-"]
[null,null,null,null,"-",null,"-","-","-"]
[null,null,null,null,"-",null,"-","-","-"]
[null,null,null,null,"-",null,"-","-","-"]
[null,null,null,null,"-",null,"-","-","-"]
[null,null,null,null,"-",null,"-","-","-"]
[null,null,null,null,"-",null,"-","-","-"]
[null,null,null,null,"-",null,"-","-","-"]
[null,null,null,null,"-",null,"-","-","-"]
[null,null,null,null,"-",null,"-","-","-"]
[null,null,null,null,"-",null,"-","-","-"]
[null,null,null,null,"-",null,"-","-","-"]
[null,null,null,null,"-",null,"-","-","-"]

{"sheet":"Marleen Kampert","index":69,"n_rows":56,"n_cols":9,"rows_kept":56,"cut":false,"hidden":false,"merged":[[19,1,19,4],[12,1,12,8],[15,1,15,4],[16,1,16,4],[17,1,17,4],[18,1,18,4],[18,7,20,8],[27,1,27,8],[30,3,30,5],[20,1,20,4],[21,7,21,8],[21,1,21,4],[22,1,22,4],[23,1,23,4],[24,1,24,4]]}
[]
[]
[]
[]
[]
[]
[]
[]
[]
[]
[]
[]
[null,"Marleen Kampert"]
[]
[]
[null,"Gespeeld",null,null,null,{"$f":"COUNTIF(G32:G57,\"W\")+COUNTIF(G32:G57,\"G\")+COUNTIF(G32:G57,\"V\")","v":9}]
[null,"Gewonnen",null,null,null,{"$f":"COUNTIF(G32:G57,\"W\")","v":5}]
[null,"Gelijk",null,null,null,{"$f":"COUNTIF(G32:G57,\"G\")","v":0}]
[null,"Verloren",null,null,null,{"$f":"COUNTIF(G32:G57,\"V\")","v":4},null,"Wijk van initiële inschrijving\n(met shirtkleur finaledag)"]
[null,"% gewonnen",null,null,null,{"$f":"IF(F16=0,0,F17/F16)","v":0.55555555555555558}]
[null,"% gelijk",null,null,null,{"$f":"IF(F16=0,0,F18/F16)","v":0}]
[null,"% verloren",null,null,null,{"$f":"IF(F16=0,0,F19/F16)","v":0.44444444444444442},null,"De Hambaken"]
[null,"Wedstrijdpunten",null,null,null,{"$f":"SUM(H32:H57)","v":15}]
[null,"Saldopunten",null,null,null,{"$f":"SUM(I32:I57)","v":25}]
[null,"Saldopunten per wedstrijd",null,null,null,{"$f":"IF(F16=0,0,F24/F16)","v":2.7777777777777777}]
[]
[]
[null,"LET OP: alleen wedstrijden die daadwerkelijk gespeeld zijn in de wijk waarvoor jij je hebt ingeschreven tellen mee!"]
[]
[]
[null,"Datum","Locatie","UITSLAGEN",null,null,"W, V of G?","Wedstrijd-punten","Saldo-punten"]
[null,"2021-06-23","De Hambaken",13,"-",0,{"$f":"IF(OR($B$13=\"\",wijk_van_inschrijving=\"\"),\"-\",IF(OR(wijk_van_inschrijving<>C32,D32=\"\",F32=\"\"),\"-\",IF(D32>F32,\"W\",IF(D32=F32,\"G\",IF(D32<F32,\"V\",\"-\")))))","v":"W"},{"$f":"IF(OR($B$13=\"\",wijk_van_inschrijving=\"\"),\"-\",IF(OR(wijk_van_inschrijving<>C32,G32=\"-\",G32=\"\"),\"-\",IF(G32=\"W\",3,IF(G32=\"G\",2,IF(G32=\"V\",0,0)))))","v":3},{"$f":"IF(OR($B$13=\"\",wijk_van_inschrijving=\"\"),\"-\",IF(wijk_van_inschrijving<>C32,\"-\",IF(D32>=0,IF(F32=\"\",\"-\",D32-F32))))","v":13}]
[null,"2021-06-23","De Hambaken",4,"-",9,"V",0,-5]
[null,"2021-06-23","De Hambaken",12,"-",5,"W",3,7]
[null,"2021-06-29","De Hambaken",13,"-",3,"W",3,10]
[null,"2021-06-29","De Hambaken",8,"-",2,"W",3,6]
[null,"2021-06-29","De Hambaken",13,"-",4,"W",3,9]
[null,"2021-07-06","De Hambaken",11,"-",13,"V",0,-2]
[null,"2021-07-06","De Hambaken",3,"-",9,"V",0,-6]
[null,"2021-07-06","De Hambaken",5,"-",12,"V",0,-7]
[null,null,null,null,"-",null,"-","-","-"]
[null,null,null,null,"-",null,"-","-","-"]
[null,null,null,null,"-",null,"-","-","-"]
[null,null,null,null,"-",null,"-","-","-"]
[null,null,null,null,"-",null,"-","-","-"]
[null,null,null,null,"-",null,"-","-","-"]
[null,null,null,null,"-",null,"-","-","-"]
[null,null,null,null,"-",null,"-","-","-"]
[null,null,null,null,"-",null,"-","-","-"]
[null,null,null,null,"-",null,"-","-","-"]
[null,null,null,null,"-",null,"-","-","-"]
[null,null,null,null,"-",null,"-","-","-"]
[null,null,null,null,"-",null,"-","-","-"]
[null,null,null,null,"-",null,"-","-","-"]
[null,null,null,null,"-",null,"-","-","-"]
[null,null,null,null,"-",null,"-","-","-"]

{"sheet":"Martha Clement","index":70,"n_rows":56,"n_cols":9,"rows_kept":56,"cut":false,"hidden":false,"merged":[[18,7,20,8],[30,3,30,5],[12,1,12,8],[15,1,15,4],[16,1,16,4],[17,1,17,4],[18,1,18,4],[19,1,19,4],[20,1,20,4],[21,1,21,4],[22,1,22,4],[23,1,23,4],[24,1,24,4],[21,7,21,8],[27,1,27,8]]}
[]
[]
[]
[]
[]
[]
[]
[]
[]
[]
[]
[]
[null,"Martha Clement"]
[]
[]
[null,"Gespeeld",null,null,null,{"$f":"COUNTIF(G32:G57,\"W\")+COUNTIF(G32:G57,\"G\")+COUNTIF(G32:G57,\"V\")","v":3}]
[null,"Gewonnen",null,null,null,{"$f":"COUNTIF(G32:G57,\"W\")","v":1}]
[null,"Gelijk",null,null,null,{"$f":"COUNTIF(G32:G57,\"G\")","v":0}]
[null,"Verloren",null,null,null,{"$f":"COUNTIF(G32:G57,\"V\")","v":2},null,"Wijk van initiële inschrijving\n(met shirtkleur finaledag)"]
[null,"% gewonnen",null,null,null,{"$f":"IF(F16=0,0,F17/F16)","v":0.33333333333333331}]
[null,"% gelijk",null,null,null,{"$f":"IF(F16=0,0,F18/F16)","v":0}]
[null,"% verloren",null,null,null,{"$f":"IF(F16=0,0,F19/F16)","v":0.66666666666666663},null,"De Schutskamp"]
[null,"Wedstrijdpunten",null,null,null,{"$f":"SUM(H32:H57)","v":3}]
[null,"Saldopunten",null,null,null,{"$f":"SUM(I32:I57)","v":-18}]
[null,"Saldopunten per wedstrijd",null,null,null,{"$f":"IF(F16=0,0,F24/F16)","v":-6}]
[]
[]
[null,"LET OP: alleen wedstrijden die daadwerkelijk gespeeld zijn in de wijk waarvoor jij je hebt ingeschreven tellen mee!"]
[]
[]
[null,"Datum","Locatie","UITSLAGEN",null,null,"W, V of G?","Wedstrijd-punten","Saldo-punten"]
[null,"2021-06-14","De Schutskamp",3,"-",13,{"$f":"IF(OR($B$13=\"\",wijk_van_inschrijving=\"\"),\"-\",IF(OR(wijk_van_inschrijving<>C32,D32=\"\",F32=\"\"),\"-\",IF(D32>F32,\"W\",IF(D32=F32,\"G\",IF(D32<F32,\"V\",\"-\")))))","v":"V"},{"$f":"IF(OR($B$13=\"\",wijk_van_inschrijving=\"\"),\"-\",IF(OR(wijk_van_inschrijving<>C32,G32=\"-\",G32=\"\"),\"-\",IF(G32=\"W\",3,IF(G32=\"G\",2,IF(G32=\"V\",0,0)))))","v":0},{"$f":"IF(OR($B$13=\"\",wijk_van_inschrijving=\"\"),\"-\",IF(wijk_van_inschrijving<>C32,\"-\",IF(D32>=0,IF(F32=\"\",\"-\",D32-F32))))","v":-10}]
[null,"2021-06-14","De Schutskamp",8,"-",5,"W",3,3]
[null,"2021-06-14","De Schutskamp",2,"-",13,"V",0,-11]
[null,null,null,null,"-",null,"-","-","-"]
[null,null,null,null,"-",null,"-","-","-"]
[null,null,null,null,"-",null,"-","-","-"]
[null,null,null,null,"-",null,"-","-","-"]
[null,null,null,null,"-",null,"-","-","-"]
[null,null,null,null,"-",null,"-","-","-"]
[null,null,null,null,"-",null,"-","-","-"]
[null,null,null,null,"-",null,"-","-","-"]
[null,null,null,null,"-",null,"-","-","-"]
[null,null,null,null,"-",null,"-","-","-"]
[null,null,null,null,"-",null,"-","-","-"]
[null,null,null,null,"-",null,"-","-","-"]
[null,null,null,null,"-",null,"-","-","-"]
[null,null,null,null,"-",null,"-","-","-"]
[null,null,null,null,"-",null,"-","-","-"]
[null,null,null,null,"-",null,"-","-","-"]
[null,null,null,null,"-",null,"-","-","-"]
[null,null,null,null,"-",null,"-","-","-"]
[null,null,null,null,"-",null,"-","-","-"]
[null,null,null,null,"-",null,"-","-","-"]
[null,null,null,null,"-",null,"-","-","-"]
[null,null,null,null,"-",null,"-","-","-"]

{"sheet":"Maurice Maas","index":71,"n_rows":56,"n_cols":9,"rows_kept":56,"cut":false,"hidden":false,"merged":[[12,1,12,8],[15,1,15,4],[16,1,16,4],[17,1,17,4],[18,1,18,4],[18,7,20,8],[19,1,19,4],[20,1,20,4],[30,3,30,5],[21,1,21,4],[21,7,21,8],[22,1,22,4],[23,1,23,4],[24,1,24,4],[27,1,27,8]]}
[]
[]
[]
[]
[]
[]
[]
[]
[]
[]
[]
[]
[null,"Maurice Maas"]
[]
[]
[null,"Gespeeld",null,null,null,{"$f":"COUNTIF(G32:G57,\"W\")+COUNTIF(G32:G57,\"G\")+COUNTIF(G32:G57,\"V\")","v":3}]
[null,"Gewonnen",null,null,null,{"$f":"COUNTIF(G32:G57,\"W\")","v":0}]
[null,"Gelijk",null,null,null,{"$f":"COUNTIF(G32:G57,\"G\")","v":0}]
[null,"Verloren",null,null,null,{"$f":"COUNTIF(G32:G57,\"V\")","v":3},null,"Wijk van initiële inschrijving\n(met shirtkleur finaledag)"]
[null,"% gewonnen",null,null,null,{"$f":"IF(F16=0,0,F17/F16)","v":0}]
[null,"% gelijk",null,null,null,{"$f":"IF(F16=0,0,F18/F16)","v":0}]
[null,"% verloren",null,null,null,{"$f":"IF(F16=0,0,F19/F16)","v":1},null,"De Schutskamp"]
[null,"Wedstrijdpunten",null,null,null,{"$f":"SUM(H32:H57)","v":0}]
[null,"Saldopunten",null,null,null,{"$f":"SUM(I32:I57)","v":-9}]
[null,"Saldopunten per wedstrijd",null,null,null,{"$f":"IF(F16=0,0,F24/F16)","v":-3}]
[]
[]
[null,"LET OP: alleen wedstrijden die daadwerkelijk gespeeld zijn in de wijk waarvoor jij je hebt ingeschreven tellen mee!"]
[]
[]
[null,"Datum","Locatie","UITSLAGEN",null,null,"W, V of G?","Wedstrijd-punten","Saldo-punten"]
[null,"2021-07-05","De Schutskamp",9,"-",13,{"$f":"IF(OR($B$13=\"\",wijk_van_inschrijving=\"\"),\"-\",IF(OR(wijk_van_inschrijving<>C32,D32=\"\",F32=\"\"),\"-\",IF(D32>F32,\"W\",IF(D32=F32,\"G\",IF(D32<F32,\"V\",\"-\")))))","v":"V"},{"$f":"IF(OR($B$13=\"\",wijk_van_inschrijving=\"\"),\"-\",IF(OR(wijk_van_inschrijving<>C32,G32=\"-\",G32=\"\"),\"-\",IF(G32=\"W\",3,IF(G32=\"G\",2,IF(G32=\"V\",0,0)))))","v":0},{"$f":"IF(OR($B$13=\"\",wijk_van_inschrijving=\"\"),\"-\",IF(wijk_van_inschrijving<>C32,\"-\",IF(D32>=0,IF(F32=\"\",\"-\",D32-F32))))","v":-4}]
[null,"2021-07-05","De Schutskamp",8,"-",12,"V",0,-4]
[null,"2021-07-05","De Schutskamp",5,"-",6,"V",0,-1]
[null,null,null,null,"-",null,"-","-","-"]
[null,null,null,null,"-",null,"-","-","-"]
[null,null,null,null,"-",null,"-","-","-"]
[null,null,null,null,"-",null,"-","-","-"]
[null,null,null,null,"-",null,"-","-","-"]
[null,null,null,null,"-",null,"-","-","-"]
[null,null,null,null,"-",null,"-","-","-"]
[null,null,null,null,"-",null,"-","-","-"]
[null,null,null,null,"-",null,"-","-","-"]
[null,null,null,null,"-",null,"-","-","-"]
[null,null,null,null,"-",null,"-","-","-"]
[null,null,null,null,"-",null,"-","-","-"]
[null,null,null,null,"-",null,"-","-","-"]
[null,null,null,null,"-",null,"-","-","-"]
[null,null,null,null,"-",null,"-","-","-"]
[null,null,null,null,"-",null,"-","-","-"]
[null,null,null,null,"-",null,"-","-","-"]
[null,null,null,null,"-",null,"-","-","-"]
[null,null,null,null,"-",null,"-","-","-"]
[null,null,null,null,"-",null,"-","-","-"]
[null,null,null,null,"-",null,"-","-","-"]
[null,null,null,null,"-",null,"-","-","-"]

{"sheet":"Mecheline Heijmans","index":72,"n_rows":56,"n_cols":9,"rows_kept":56,"cut":false,"hidden":false,"merged":[[18,7,20,8],[30,3,30,5],[12,1,12,8],[15,1,15,4],[16,1,16,4],[17,1,17,4],[18,1,18,4],[19,1,19,4],[20,1,20,4],[21,1,21,4],[22,1,22,4],[23,1,23,4],[24,1,24,4],[21,7,21,8],[27,1,27,8]]}
[]
[]
[]
[]
[]
[]
[]
[]
[]
[]
[]
[]
[null,"Mecheline Heijmans"]
[]
[]
[null,"Gespeeld",null,null,null,{"$f":"COUNTIF(G32:G57,\"W\")+COUNTIF(G32:G57,\"G\")+COUNTIF(G32:G57,\"V\")","v":7}]
[null,"Gewonnen",null,null,null,{"$f":"COUNTIF(G32:G57,\"W\")","v":4}]
[null,"Gelijk",null,null,null,{"$f":"COUNTIF(G32:G57,\"G\")","v":1}]
[null,"Verloren",null,null,null,{"$f":"COUNTIF(G32:G57,\"V\")","v":2},null,"Wijk van initiële inschrijving\n(met shirtkleur finaledag)"]
[null,"% gewonnen",null,null,null,{"$f":"IF(F16=0,0,F17/F16)","v":0.5714285714285714}]
[null,"% gelijk",null,null,null,{"$f":"IF(F16=0,0,F18/F16)","v":0.14285714285714285}]
[null,"% verloren",null,null,null,{"$f":"IF(F16=0,0,F19/F16)","v":0.2857142857142857},null,"Hondsberg (Rosmalen)"]
[null,"Wedstrijdpunten",null,null,null,{"$f":"SUM(H32:H57)","v":14}]
[null,"Saldopunten",null,null,null,{"$f":"SUM(I32:I57)","v":6}]
[null,"Saldopunten per wedstrijd",null,null,null,{"$f":"IF(F16=0,0,F24/F16)","v":0.8571428571428571}]
[]
[]
[null,"LET OP: alleen wedstrijden die daadwerkelijk gespeeld zijn in de wijk waarvoor jij je hebt ingeschreven tellen mee!"]
[]
[]
[null,"Datum","Locatie","UITSLAGEN",null,null,"W, V of G?","Wedstrijd-punten","Saldo-punten"]
[null,"2021-06-15","Hondsberg (Rosmalen)",2,"-",12,{"$f":"IF(OR($B$13=\"\",wijk_van_inschrijving=\"\"),\"-\",IF(OR(wijk_van_inschrijving<>C32,D32=\"\",F32=\"\"),\"-\",IF(D32>F32,\"W\",IF(D32=F32,\"G\",IF(D32<F32,\"V\",\"-\")))))","v":"V"},{"$f":"IF(OR($B$13=\"\",wijk_van_inschrijving=\"\"),\"-\",IF(OR(wijk_van_inschrijving<>C32,G32=\"-\",G32=\"\"),\"-\",IF(G32=\"W\",3,IF(G32=\"G\",2,IF(G32=\"V\",0,0)))))","v":0},{"$f":"IF(OR($B$13=\"\",wijk_van_inschrijving=\"\"),\"-\",IF(wijk_van_inschrijving<>C32,\"-\",IF(D32>=0,IF(F32=\"\",\"-\",D32-F32))))","v":-10}]
[null,"2021-06-15","Hondsberg (Rosmalen)",6,"-",6,"G",2,0]
[null,"2021-06-15","Hondsberg (Rosmalen)",13,"-",6,"W",3,7]
[null,"2021-06-22","Hondsberg (Rosmalen)",2,"-",9,"V",0,-7]
[null,"2021-06-22","Hondsberg (Rosmalen)",7,"-",3,"W",3,4]
[null,"2021-06-30","Hondsberg (Rosmalen)",13,"-",5,"W",3,8]
[null,"2021-06-30","Hondsberg (Rosmalen)",9,"-",5,"W",3,4]
[null,null,null,null,"-",null,"-","-","-"]
[null,null,null,null,"-",null,"-","-","-"]
[null,null,null,null,"-",null,"-","-","-"]
[null,null,null,null,"-",null,"-","-","-"]
[null,null,null,null,"-",null,"-","-","-"]
[null,null,null,null,"-",null,"-","-","-"]
[null,null,null,null,"-",null,"-","-","-"]
[null,null,null,null,"-",null,"-","-","-"]
[null,null,null,null,"-",null,"-","-","-"]
[null,null,null,null,"-",null,"-","-","-"]
[null,null,null,null,"-",null,"-","-","-"]
[null,null,null,null,"-",null,"-","-","-"]
[null,null,null,null,"-",null,"-","-","-"]
[null,null,null,null,"-",null,"-","-","-"]
[null,null,null,null,"-",null,"-","-","-"]
[null,null,null,null,"-",null,"-","-","-"]
[null,null,null,null,"-",null,"-","-","-"]
[null,null,null,null,"-",null,"-","-","-"]

{"sheet":"Mels van der Doelen","index":73,"n_rows":56,"n_cols":9,"rows_kept":56,"cut":false,"hidden":false,"merged":[[27,1,27,8],[30,3,30,5],[20,1,20,4],[21,7,21,8],[21,1,21,4],[22,1,22,4],[23,1,23,4],[24,1,24,4],[18,7,20,8],[19,1,19,4],[12,1,12,8],[15,1,15,4],[16,1,16,4],[17,1,17,4],[18,1,18,4]]}
[]
[]
[]
[]
[]
[]
[]
[]
[]
[]
[]
[]
[null,"Mels van der Doelen"]
[]
[]
[null,"Gespeeld",null,null,null,{"$f":"COUNTIF(G32:G57,\"W\")+COUNTIF(G32:G57,\"G\")+COUNTIF(G32:G57,\"V\")","v":2}]
[null,"Gewonnen",null,null,null,{"$f":"COUNTIF(G32:G57,\"W\")","v":0}]
[null,"Gelijk",null,null,null,{"$f":"COUNTIF(G32:G57,\"G\")","v":0}]
[null,"Verloren",null,null,null,{"$f":"COUNTIF(G32:G57,\"V\")","v":2},null,"Wijk van initiële inschrijving\n(met shirtkleur finaledag)"]
[null,"% gewonnen",null,null,null,{"$f":"IF(F16=0,0,F17/F16)","v":0}]
[null,"% gelijk",null,null,null,{"$f":"IF(F16=0,0,F18/F16)","v":0}]
[null,"% verloren",null,null,null,{"$f":"IF(F16=0,0,F19/F16)","v":1},null,"Hondsberg (Rosmalen)"]
[null,"Wedstrijdpunten",null,null,null,{"$f":"SUM(H32:H57)","v":0}]
[null,"Saldopunten",null,null,null,{"$f":"SUM(I32:I57)","v":-13}]
[null,"Saldopunten per wedstrijd",null,null,null,{"$f":"IF(F16=0,0,F24/F16)","v":-6.5}]
[]
[]
[null,"LET OP: alleen wedstrijden die daadwerkelijk gespeeld zijn in de wijk waarvoor jij je hebt ingeschreven tellen mee!"]
[]
[]
[null,"Datum","Locatie","UITSLAGEN",null,null,"W, V of G?","Wedstrijd-punten","Saldo-punten"]
[null,"2021-06-22","Hondsberg (Rosmalen)",2,"-",11,{"$f":"IF(OR($B$13=\"\",wijk_van_inschrijving=\"\"),\"-\",IF(OR(wijk_van_inschrijving<>C32,D32=\"\",F32=\"\"),\"-\",IF(D32>F32,\"W\",IF(D32=F32,\"G\",IF(D32<F32,\"V\",\"-\")))))","v":"V"},{"$f":"IF(OR($B$13=\"\",wijk_van_inschrijving=\"\"),\"-\",IF(OR(wijk_van_inschrijving<>C32,G32=\"-\",G32=\"\"),\"-\",IF(G32=\"W\",3,IF(G32=\"G\",2,IF(G32=\"V\",0,0)))))","v":0},{"$f":"IF(OR($B$13=\"\",wijk_van_inschrijving=\"\"),\"-\",IF(wijk_van_inschrijving<>C32,\"-\",IF(D32>=0,IF(F32=\"\",\"-\",D32-F32))))","v":-9}]
[null,"2021-06-22","Hondsberg (Rosmalen)",3,"-",7,"V",0,-4]
[null,null,null,null,"-",null,"-","-","-"]
[null,null,null,null,"-",null,"-","-","-"]
[null,null,null,null,"-",null,"-","-","-"]
[null,null,null,null,"-",null,"-","-","-"]
[null,null,null,null,"-",null,"-","-","-"]
[null,null,null,null,"-",null,"-","-","-"]
[null,null,null,null,"-",null,"-","-","-"]
[null,null,null,null,"-",null,"-","-","-"]
[null,null,null,null,"-",null,"-","-","-"]
[null,null,null,null,"-",null,"-","-","-"]
[null,null,null,null,"-",null,"-","-","-"]
[null,null,null,null,"-",null,"-","-","-"]
[null,null,null,null,"-",null,"-","-","-"]
[null,null,null,null,"-",null,"-","-","-"]
[null,null,null,null,"-",null,"-","-","-"]
[null,null,null,null,"-",null,"-","-","-"]
[null,null,null,null,"-",null,"-","-","-"]
[null,null,null,null,"-",null,"-","-","-"]
[null,null,null,null,"-",null,"-","-","-"]
[null,null,null,null,"-",null,"-","-","-"]
[null,null,null,null,"-",null,"-","-","-"]
[null,null,null,null,"-",null,"-","-","-"]
[null,null,null,null,"-",null,"-","-","-"]

{"sheet":"Mieke Lakwijk","index":74,"n_rows":56,"n_cols":9,"rows_kept":56,"cut":false,"hidden":false,"merged":[[18,7,20,8],[30,3,30,5],[12,1,12,8],[15,1,15,4],[16,1,16,4],[17,1,17,4],[18,1,18,4],[19,1,19,4],[20,1,20,4],[21,1,21,4],[22,1,22,4],[23,1,23,4],[24,1,24,4],[21,7,21,8],[27,1,27,8]]}
[]
[]
[]
[]
[]
[]
[]
[]
[]
[]
[]
[]
[null,"Mieke Lakwijk"]
[]
[]
[null,"Gespeeld",null,null,null,{"$f":"COUNTIF(G32:G57,\"W\")+COUNTIF(G32:G57,\"G\")+COUNTIF(G32:G57,\"V\")","v":9}]
[null,"Gewonnen",null,null,null,{"$f":"COUNTIF(G32:G57,\"W\")","v":3}]
[null,"Gelijk",null,null,null,{"$f":"COUNTIF(G32:G57,\"G\")","v":1}]
[null,"Verloren",null,null,null,{"$f":"COUNTIF(G32:G57,\"V\")","v":5},null,"Wijk van initiële inschrijving\n(met shirtkleur finaledag)"]
[null,"% gewonnen",null,null,null,{"$f":"IF(F16=0,0,F17/F16)","v":0.33333333333333331}]
[null,"% gelijk",null,null,null,{"$f":"IF(F16=0,0,F18/F16)","v":0.1111111111111111}]
[null,"% verloren",null,null,null,{"$f":"IF(F16=0,0,F19/F16)","v":0.55555555555555558},null,"De Schutskamp"]
[null,"Wedstrijdpunten",null,null,null,{"$f":"SUM(H32:H57)","v":11}]
[null,"Saldopunten",null,null,null,{"$f":"SUM(I32:I57)","v":-41}]
[null,"Saldopunten per wedstrijd",null,null,null,{"$f":"IF(F16=0,0,F24/F16)","v":-4.5555555555555554}]
[]
[]
[null,"LET OP: alleen wedstrijden die daadwerkelijk gespeeld zijn in de wijk waarvoor jij je hebt ingeschreven tellen mee!"]
[]
[]
[null,"Datum","Locatie","UITSLAGEN",null,null,"W, V of G?","Wedstrijd-punten","Saldo-punten"]
[null,"2021-06-14","De Schutskamp",7,"-",13,{"$f":"IF(OR($B$13=\"\",wijk_van_inschrijving=\"\"),\"-\",IF(OR(wijk_van_inschrijving<>C32,D32=\"\",F32=\"\"),\"-\",IF(D32>F32,\"W\",IF(D32=F32,\"G\",IF(D32<F32,\"V\",\"-\")))))","v":"V"},{"$f":"IF(OR($B$13=\"\",wijk_van_inschrijving=\"\"),\"-\",IF(OR(wijk_van_inschrijving<>C32,G32=\"-\",G32=\"\"),\"-\",IF(G32=\"W\",3,IF(G32=\"G\",2,IF(G32=\"V\",0,0)))))","v":0},{"$f":"IF(OR($B$13=\"\",wijk_van_inschrijving=\"\"),\"-\",IF(wijk_van_inschrijving<>C32,\"-\",IF(D32>=0,IF(F32=\"\",\"-\",D32-F32))))","v":-6}]
[null,"2021-06-14","De Schutskamp",4,"-",3,"W",3,1]
[null,"2021-06-14","De Schutskamp",12,"-",7,"W",3,5]
[null,"2021-06-28","De Schutskamp",3,"-",13,"V",0,-10]
[null,"2021-06-28","De Schutskamp",1,"-",13,"V",0,-12]
[null,"2021-06-28","De Schutskamp",9,"-",9,"G",2,0]
[null,"2021-07-05","De Schutskamp",8,"-",6,"W",3,2]
[null,"2021-07-05","De Schutskamp",2,"-",13,"V",0,-11]
[null,"2021-07-05","De Schutskamp",3,"-",13,"V",0,-10]
[null,null,null,null,"-",null,"-","-","-"]
[null,null,null,null,"-",null,"-","-","-"]
[null,null,null,null,"-",null,"-","-","-"]
[null,null,null,null,"-",null,"-","-","-"]
[null,null,null,null,"-",null,"-","-","-"]
[null,null,null,null,"-",null,"-","-","-"]
[null,null,null,null,"-",null,"-","-","-"]
[null,null,null,null,"-",null,"-","-","-"]
[null,null,null,null,"-",null,"-","-","-"]
[null,null,null,null,"-",null,"-","-","-"]
[null,null,null,null,"-",null,"-","-","-"]
[null,null,null,null,"-",null,"-","-","-"]
[null,null,null,null,"-",null,"-","-","-"]
[null,null,null,null,"-",null,"-","-","-"]
[null,null,null,null,"-",null,"-","-","-"]
[null,null,null,null,"-",null,"-","-","-"]

{"sheet":"Mien van Tilburg","index":75,"n_rows":56,"n_cols":9,"rows_kept":56,"cut":false,"hidden":false,"merged":[[18,7,20,8],[30,3,30,5],[12,1,12,8],[15,1,15,4],[16,1,16,4],[17,1,17,4],[18,1,18,4],[19,1,19,4],[20,1,20,4],[21,1,21,4],[22,1,22,4],[23,1,23,4],[24,1,24,4],[21,7,21,8],[27,1,27,8]]}
[]
[]
[]
[]
[]
[]
[]
[]
[]
[]
[]
[]
[null,"Mien van Tilburg"]
[]
[]
[null,"Gespeeld",null,null,null,{"$f":"COUNTIF(G32:G57,\"W\")+COUNTIF(G32:G57,\"G\")+COUNTIF(G32:G57,\"V\")","v":12}]
[null,"Gewonnen",null,null,null,{"$f":"COUNTIF(G32:G57,\"W\")","v":4}]
[null,"Gelijk",null,null,null,{"$f":"COUNTIF(G32:G57,\"G\")","v":1}]
[null,"Verloren",null,null,null,{"$f":"COUNTIF(G32:G57,\"V\")","v":7},null,"Wijk van initiële inschrijving\n(met shirtkleur finaledag)"]
[null,"% gewonnen",null,null,null,{"$f":"IF(F16=0,0,F17/F16)","v":0.33333333333333331}]
[null,"% gelijk",null,null,null,{"$f":"IF(F16=0,0,F18/F16)","v":8.3333333333333329E-2}]
[null,"% verloren",null,null,null,{"$f":"IF(F16=0,0,F19/F16)","v":0.58333333333333337},null,"De Schutskamp"]
[null,"Wedstrijdpunten",null,null,null,{"$f":"SUM(H32:H57)","v":14}]
[null,"Saldopunten",null,null,null,{"$f":"SUM(I32:I57)","v":-31}]
[null,"Saldopunten per wedstrijd",null,null,null,{"$f":"IF(F16=0,0,F24/F16)","v":-2.5833333333333335}]
[]
[]
[null,"LET OP: alleen wedstrijden die daadwerkelijk gespeeld zijn in de wijk waarvoor jij je hebt ingeschreven tellen mee!"]
[]
[]
[null,"Datum","Locatie","UITSLAGEN",null,null,"W, V of G?","Wedstrijd-punten","Saldo-punten"]
[null,"2021-06-14","De Schutskamp",0,"-",13,{"$f":"IF(OR($B$13=\"\",wijk_van_inschrijving=\"\"),\"-\",IF(OR(wijk_van_inschrijving<>C32,D32=\"\",F32=\"\"),\"-\",IF(D32>F32,\"W\",IF(D32=F32,\"G\",IF(D32<F32,\"V\",\"-\")))))","v":"V"},{"$f":"IF(OR($B$13=\"\",wijk_van_inschrijving=\"\"),\"-\",IF(OR(wijk_van_inschrijving<>C32,G32=\"-\",G32=\"\"),\"-\",IF(G32=\"W\",3,IF(G32=\"G\",2,IF(G32=\"V\",0,0)))))","v":0},{"$f":"IF(OR($B$13=\"\",wijk_van_inschrijving=\"\"),\"-\",IF(wijk_van_inschrijving<>C32,\"-\",IF(D32>=0,IF(F32=\"\",\"-\",D32-F32))))","v":-13}]
[null,"2021-06-14","De Schutskamp",1,"-",8,"V",0,-7]
[null,"2021-06-14","De Schutskamp",5,"-",13,"V",0,-8]
[null,"2021-06-24","De Schutskamp",8,"-",13,"V",0,-5]
[null,"2021-06-24","De Schutskamp",10,"-",6,"W",3,4]
[null,"2021-06-24","De Schutskamp",8,"-",9,"V",0,-1]
[null,"2021-06-28","De Schutskamp",8,"-",4,"W",3,4]
[null,"2021-06-28","De Schutskamp",4,"-",13,"V",0,-9]
[null,"2021-06-28","De Schutskamp",9,"-",9,"G",2,0]
[null,"2021-07-05","De Schutskamp",6,"-",10,"V",0,-4]
[null,"2021-07-05","De Schutskamp",13,"-",6,"W",3,7]
[null,"2021-07-05","De Schutskamp",6,"-",5,"W",3,1]
[null,null,null,null,"-",null,"-","-","-"]
[null,null,null,null,"-",null,"-","-","-"]
[null,null,null,null,"-",null,"-","-","-"]
[null,null,null,null,"-",null,"-","-","-"]
[null,null,null,null,"-",null,"-","-","-"]
[null,null,null,null,"-",null,"-","-","-"]
[null,null,null,null,"-",null,"-","-","-"]
[null,null,null,null,"-",null,"-","-","-"]
[null,null,null,null,"-",null,"-","-","-"]
[null,null,null,null,"-",null,"-","-","-"]
[null,null,null,null,"-",null,"-","-","-"]
[null,null,null,null,"-",null,"-","-","-"]
[null,null,null,null,"-",null,"-","-","-"]

{"sheet":"Mohammed Nazih","index":76,"n_rows":56,"n_cols":9,"rows_kept":56,"cut":false,"hidden":false,"merged":[[18,7,20,8],[30,3,30,5],[12,1,12,8],[15,1,15,4],[16,1,16,4],[17,1,17,4],[18,1,18,4],[19,1,19,4],[20,1,20,4],[21,1,21,4],[22,1,22,4],[23,1,23,4],[24,1,24,4],[21,7,21,8],[27,1,27,8]]}
[]
[]
[]
[]
[]
[]
[]
[]
[]
[]
[]
[]
[null,"Mohammed Nazih"]
[]
[]
[null,"Gespeeld",null,null,null,{"$f":"COUNTIF(G32:G57,\"W\")+COUNTIF(G32:G57,\"G\")+COUNTIF(G32:G57,\"V\")","v":6}]
[null,"Gewonnen",null,null,null,{"$f":"COUNTIF(G32:G57,\"W\")","v":3}]
[null,"Gelijk",null,null,null,{"$f":"COUNTIF(G32:G57,\"G\")","v":0}]
[null,"Verloren",null,null,null,{"$f":"COUNTIF(G32:G57,\"V\")","v":3},null,"Wijk van initiële inschrijving\n(met shirtkleur finaledag)"]
[null,"% gewonnen",null,null,null,{"$f":"IF(F16=0,0,F17/F16)","v":0.5}]
[null,"% gelijk",null,null,null,{"$f":"IF(F16=0,0,F18/F16)","v":0}]
[null,"% verloren",null,null,null,{"$f":"IF(F16=0,0,F19/F16)","v":0.5},null,"De Schutskamp"]
[null,"Wedstrijdpunten",null,null,null,{"$f":"SUM(H32:H57)","v":9}]
[null,"Saldopunten",null,null,null,{"$f":"SUM(I32:I57)","v":-6}]
[null,"Saldopunten per wedstrijd",null,null,null,{"$f":"IF(F16=0,0,F24/F16)","v":-1}]
[]
[]
[null,"LET OP: alleen wedstrijden die daadwerkelijk gespeeld zijn in de wijk waarvoor jij je hebt ingeschreven tellen mee!"]
[]
[]
[null,"Datum","Locatie","UITSLAGEN",null,null,"W, V of G?","Wedstrijd-punten","Saldo-punten"]
[null,"2021-06-14","De Schutskamp",3,"-",13,{"$f":"IF(OR($B$13=\"\",wijk_van_inschrijving=\"\"),\"-\",IF(OR(wijk_van_inschrijving<>C32,D32=\"\",F32=\"\"),\"-\",IF(D32>F32,\"W\",IF(D32=F32,\"G\",IF(D32<F32,\"V\",\"-\")))))","v":"V"},{"$f":"IF(OR($B$13=\"\",wijk_van_inschrijving=\"\"),\"-\",IF(OR(wijk_van_inschrijving<>C32,G32=\"-\",G32=\"\"),\"-\",IF(G32=\"W\",3,IF(G32=\"G\",2,IF(G32=\"V\",0,0)))))","v":0},{"$f":"IF(OR($B$13=\"\",wijk_van_inschrijving=\"\"),\"-\",IF(wijk_van_inschrijving<>C32,\"-\",IF(D32>=0,IF(F32=\"\",\"-\",D32-F32))))","v":-10}]
[null,"2021-06-14","De Schutskamp",7,"-",4,"W",3,3]
[null,"2021-06-14","De Schutskamp",7,"-",12,"V",0,-5]
[null,"2021-07-05","De Schutskamp",10,"-",6,"W",3,4]
[null,"2021-07-05","De Schutskamp",2,"-",13,"V",0,-11]
[null,"2021-07-05","De Schutskamp",13,"-",0,"W",3,13]
[null,null,null,null,"-",null,"-","-","-"]
[null,null,null,null,"-",null,"-","-","-"]
[null,null,null,null,"-",null,"-","-","-"]
[null,null,null,null,"-",null,"-","-","-"]
[null,null,null,null,"-",null,"-","-","-"]
[null,null,null,null,"-",null,"-","-","-"]
[null,null,null,null,"-",null,"-","-","-"]
[null,null,null,null,"-",null,"-","-","-"]
[null,null,null,null,"-",null,"-","-","-"]
[null,null,null,null,"-",null,"-","-","-"]
[null,null,null,null,"-",null,"-","-","-"]
[null,null,null,null,"-",null,"-","-","-"]
[null,null,null,null,"-",null,"-","-","-"]
[null,null,null,null,"-",null,"-","-","-"]
[null,null,null,null,"-",null,"-","-","-"]
[null,null,null,null,"-",null,"-","-","-"]
[null,null,null,null,"-",null,"-","-","-"]
[null,null,null,null,"-",null,"-","-","-"]
[null,null,null,null,"-",null,"-","-","-"]

{"sheet":"Mohammed Serraji","index":77,"n_rows":56,"n_cols":9,"rows_kept":56,"cut":false,"hidden":false,"merged":[[18,7,20,8],[30,3,30,5],[12,1,12,8],[15,1,15,4],[16,1,16,4],[17,1,17,4],[18,1,18,4],[19,1,19,4],[20,1,20,4],[21,1,21,4],[22,1,22,4],[23,1,23,4],[24,1,24,4],[21,7,21,8],[27,1,27,8]]}
[]
[]
[]
[]
[]
[]
[]
[]
[]
[]
[]
[]
[null,"Mohammed Serraji"]
[]
[]
[null,"Gespeeld",null,null,null,{"$f":"COUNTIF(G32:G57,\"W\")+COUNTIF(G32:G57,\"G\")+COUNTIF(G32:G57,\"V\")","v":12}]
[null,"Gewonnen",null,null,null,{"$f":"COUNTIF(G32:G57,\"W\")","v":6}]
[null,"Gelijk",null,null,null,{"$f":"COUNTIF(G32:G57,\"G\")","v":1}]
[null,"Verloren",null,null,null,{"$f":"COUNTIF(G32:G57,\"V\")","v":5},null,"Wijk van initiële inschrijving\n(met shirtkleur finaledag)"]
[null,"% gewonnen",null,null,null,{"$f":"IF(F16=0,0,F17/F16)","v":0.5}]
[null,"% gelijk",null,null,null,{"$f":"IF(F16=0,0,F18/F16)","v":8.3333333333333329E-2}]
[null,"% verloren",null,null,null,{"$f":"IF(F16=0,0,F19/F16)","v":0.41666666666666669},null,"De Schutskamp"]
[null,"Wedstrijdpunten",null,null,null,{"$f":"SUM(H32:H57)","v":20}]
[null,"Saldopunten",null,null,null,{"$f":"SUM(I32:I57)","v":0}]
[null,"Saldopunten per wedstrijd",null,null,null,{"$f":"IF(F16=0,0,F24/F16)","v":0}]
[]
[]
[null,"LET OP: alleen wedstrijden die daadwerkelijk gespeeld zijn in de wijk waarvoor jij je hebt ingeschreven tellen mee!"]
[]
[]
[null,"Datum","Locatie","UITSLAGEN",null,null,"W, V of G?","Wedstrijd-punten","Saldo-punten"]
[null,"2021-06-14","De Schutskamp",4,"-",8,{"$f":"IF(OR($B$13=\"\",wijk_van_inschrijving=\"\"),\"-\",IF(OR(wijk_van_inschrijving<>C32,D32=\"\",F32=\"\"),\"-\",IF(D32>F32,\"W\",IF(D32=F32,\"G\",IF(D32<F32,\"V\",\"-\")))))","v":"V"},{"$f":"IF(OR($B$13=\"\",wijk_van_inschrijving=\"\"),\"-\",IF(OR(wijk_van_inschrijving<>C32,G32=\"-\",G32=\"\"),\"-\",IF(G32=\"W\",3,IF(G32=\"G\",2,IF(G32=\"V\",0,0)))))","v":0},{"$f":"IF(OR($B$13=\"\",wijk_van_inschrijving=\"\"),\"-\",IF(wijk_van_inschrijving<>C32,\"-\",IF(D32>=0,IF(F32=\"\",\"-\",D32-F32))))","v":-4}]
[null,"2021-06-14","De Schutskamp",3,"-",4,"V",0,-1]
[null,"2021-06-14","De Schutskamp",5,"-",13,"V",0,-8]
[null,"2021-06-24","De Schutskamp",5,"-",5,"G",2,0]
[null,"2021-06-24","De Schutskamp",13,"-",3,"W",3,10]
[null,"2021-06-24","De Schutskamp",9,"-",8,"W",3,1]
[null,"2021-06-28","De Schutskamp",8,"-",4,"W",3,4]
[null,"2021-06-28","De Schutskamp",5,"-",3,"W",3,2]
[null,"2021-06-28","De Schutskamp",2,"-",13,"V",0,-11]
[null,"2021-07-05","De Schutskamp",5,"-",7,"V",0,-2]
[null,"2021-07-05","De Schutskamp",13,"-",6,"W",3,7]
[null,"2021-07-05","De Schutskamp",8,"-",6,"W",3,2]
[null,null,null,null,"-",null,"-","-","-"]
[null,null,null,null,"-",null,"-","-","-"]
[null,null,null,null,"-",null,"-","-","-"]
[null,null,null,null,"-",null,"-","-","-"]
[null,null,null,null,"-",null,"-","-","-"]
[null,null,null,null,"-",null,"-","-","-"]
[null,null,null,null,"-",null,"-","-","-"]
[null,null,null,null,"-",null,"-","-","-"]
[null,null,null,null,"-",null,"-","-","-"]
[null,null,null,null,"-",null,"-","-","-"]
[null,null,null,null,"-",null,"-","-","-"]
[null,null,null,null,"-",null,"-","-","-"]
[null,null,null,null,"-",null,"-","-","-"]

{"sheet":"Monique van Steeden","index":78,"n_rows":56,"n_cols":9,"rows_kept":56,"cut":false,"hidden":false,"merged":[[18,7,20,8],[30,3,30,5],[12,1,12,8],[15,1,15,4],[16,1,16,4],[17,1,17,4],[18,1,18,4],[19,1,19,4],[20,1,20,4],[21,1,21,4],[22,1,22,4],[23,1,23,4],[24,1,24,4],[21,7,21,8],[27,1,27,8]]}
[]
[]
[]
[]
[]
[]
[]
[]
[]
[]
[]
[]
[null,"Monique van Steeden"]
[]
[]
[null,"Gespeeld",null,null,null,{"$f":"COUNTIF(G32:G57,\"W\")+COUNTIF(G32:G57,\"G\")+COUNTIF(G32:G57,\"V\")","v":9}]
[null,"Gewonnen",null,null,null,{"$f":"COUNTIF(G32:G57,\"W\")","v":4}]
[null,"Gelijk",null,null,null,{"$f":"COUNTIF(G32:G57,\"G\")","v":1}]
[null,"Verloren",null,null,null,{"$f":"COUNTIF(G32:G57,\"V\")","v":4},null,"Wijk van initiële inschrijving\n(met shirtkleur finaledag)"]
[null,"% gewonnen",null,null,null,{"$f":"IF(F16=0,0,F17/F16)","v":0.44444444444444442}]
[null,"% gelijk",null,null,null,{"$f":"IF(F16=0,0,F18/F16)","v":0.1111111111111111}]
[null,"% verloren",null,null,null,{"$f":"IF(F16=0,0,F19/F16)","v":0.44444444444444442},null,"'s-Hertogenbosch Zuid"]
[null,"Wedstrijdpunten",null,null,null,{"$f":"SUM(H32:H57)","v":14}]
[null,"Saldopunten",null,null,null,{"$f":"SUM(I32:I57)","v":3}]
[null,"Saldopunten per wedstrijd",null,null,null,{"$f":"IF(F16=0,0,F24/F16)","v":0.33333333333333331}]
[]
[]
[null,"LET OP: alleen wedstrijden die daadwerkelijk gespeeld zijn in de wijk waarvoor jij je hebt ingeschreven tellen mee!"]
[]
[]
[null,"Datum","Locatie","UITSLAGEN",null,null,"W, V of G?","Wedstrijd-punten","Saldo-punten"]
[null,"2021-06-14","De Schutskamp",5,"-",9,{"$f":"IF(OR($B$13=\"\",wijk_van_inschrijving=\"\"),\"-\",IF(OR(wijk_van_inschrijving<>C32,D32=\"\",F32=\"\"),\"-\",IF(D32>F32,\"W\",IF(D32=F32,\"G\",IF(D32<F32,\"V\",\"-\")))))","v":"-"},{"$f":"IF(OR($B$13=\"\",wijk_van_inschrijving=\"\"),\"-\",IF(OR(wijk_van_inschrijving<>C32,G32=\"-\",G32=\"\"),\"-\",IF(G32=\"W\",3,IF(G32=\"G\",2,IF(G32=\"V\",0,0)))))","v":"-"},{"$f":"IF(OR($B$13=\"\",wijk_van_inschrijving=\"\"),\"-\",IF(wijk_van_inschrijving<>C32,\"-\",IF(D32>=0,IF(F32=\"\",\"-\",D32-F32))))","v":"-"}]
[null,"2021-06-14","De Schutskamp",4,"-",7,"-","-","-"]
[null,"2021-06-14","De Schutskamp",9,"-",4,"-","-","-"]
[null,"2021-06-25","'s-Hertogenbosch Zuid",9,"-",9,"G",2,0]
[null,"2021-06-25","'s-Hertogenbosch Zuid",12,"-",5,"W",3,7]
[null,"2021-06-25","'s-Hertogenbosch Zuid",12,"-",5,"W",3,7]
[null,"2021-07-01","'s-Hertogenbosch Zuid",13,"-",0,"W",3,13]
[null,"2021-07-01","'s-Hertogenbosch Zuid",6,"-",8,"V",0,-2]
[null,"2021-07-01","'s-Hertogenbosch Zuid",9,"-",8,"W",3,1]
[null,"2021-07-08","'s-Hertogenbosch Zuid",3,"-",13,"V",0,-10]
[null,"2021-07-08","'s-Hertogenbosch Zuid",1,"-",13,"V",0,-12]
[null,"2021-07-08","'s-Hertogenbosch Zuid",5,"-",6,"V",0,-1]
[null,null,null,null,"-",null,"-","-","-"]
[null,null,null,null,"-",null,"-","-","-"]
[null,null,null,null,"-",null,"-","-","-"]
[null,null,null,null,"-",null,"-","-","-"]
[null,null,null,null,"-",null,"-","-","-"]
[null,null,null,null,"-",null,"-","-","-"]
[null,null,null,null,"-",null,"-","-","-"]
[null,null,null,null,"-",null,"-","-","-"]
[null,null,null,null,"-",null,"-","-","-"]
[null,null,null,null,"-",null,"-","-","-"]
[null,null,null,null,"-",null,"-","-","-"]
[null,null,null,null,"-",null,"-","-","-"]
[null,null,null,null,"-",null,"-","-","-"]

{"sheet":"Mustafa El Amouri","index":79,"n_rows":56,"n_cols":9,"rows_kept":56,"cut":false,"hidden":false,"merged":[[27,1,27,8],[30,3,30,5],[20,1,20,4],[21,7,21,8],[21,1,21,4],[22,1,22,4],[23,1,23,4],[24,1,24,4],[18,7,20,8],[19,1,19,4],[12,1,12,8],[15,1,15,4],[16,1,16,4],[17,1,17,4],[18,1,18,4]]}
[]
[]
[]
[]
[]
[]
[]
[]
[]
[]
[]
[]
[null,"Mustafa El Amouri"]
[]
[]
[null,"Gespeeld",null,null,null,{"$f":"COUNTIF(G32:G57,\"W\")+COUNTIF(G32:G57,\"G\")+COUNTIF(G32:G57,\"V\")","v":3}]
[null,"Gewonnen",null,null,null,{"$f":"COUNTIF(G32:G57,\"W\")","v":1}]
[null,"Gelijk",null,null,null,{"$f":"COUNTIF(G32:G57,\"G\")","v":0}]
[null,"Verloren",null,null,null,{"$f":"COUNTIF(G32:G57,\"V\")","v":2},null,"Wijk van initiële inschrijving\n(met shirtkleur finaledag)"]
[null,"% gewonnen",null,null,null,{"$f":"IF(F16=0,0,F17/F16)","v":0.33333333333333331}]
[null,"% gelijk",null,null,null,{"$f":"IF(F16=0,0,F18/F16)","v":0}]
[null,"% verloren",null,null,null,{"$f":"IF(F16=0,0,F19/F16)","v":0.66666666666666663},null,"De Schutskamp"]
[null,"Wedstrijdpunten",null,null,null,{"$f":"SUM(H32:H57)","v":3}]
[null,"Saldopunten",null,null,null,{"$f":"SUM(I32:I57)","v":-11}]
[null,"Saldopunten per wedstrijd",null,null,null,{"$f":"IF(F16=0,0,F24/F16)","v":-3.6666666666666665}]
[]
[]
[null,"LET OP: alleen wedstrijden die daadwerkelijk gespeeld zijn in de wijk waarvoor jij je hebt ingeschreven tellen mee!"]
[]
[]
[null,"Datum","Locatie","UITSLAGEN",null,null,"W, V of G?","Wedstrijd-punten","Saldo-punten"]
[null,"2021-06-24","De Schutskamp",6,"-",8,{"$f":"IF(OR($B$13=\"\",wijk_van_inschrijving=\"\"),\"-\",IF(OR(wijk_van_inschrijving<>C32,D32=\"\",F32=\"\"),\"-\",IF(D32>F32,\"W\",IF(D32=F32,\"G\",IF(D32<F32,\"V\",\"-\")))))","v":"V"},{"$f":"IF(OR($B$13=\"\",wijk_van_inschrijving=\"\"),\"-\",IF(OR(wijk_van_inschrijving<>C32,G32=\"-\",G32=\"\"),\"-\",IF(G32=\"W\",3,IF(G32=\"G\",2,IF(G32=\"V\",0,0)))))","v":0},{"$f":"IF(OR($B$13=\"\",wijk_van_inschrijving=\"\"),\"-\",IF(wijk_van_inschrijving<>C32,\"-\",IF(D32>=0,IF(F32=\"\",\"-\",D32-F32))))","v":-2}]
[null,"2021-06-24","De Schutskamp",3,"-",13,"V",0,-10]
[null,"2021-06-24","De Schutskamp",13,"-",12,"W",3,1]
[null,null,null,null,"-",null,"-","-","-"]
[null,null,null,null,"-",null,"-","-","-"]
[null,null,null,null,"-",null,"-","-","-"]
[null,null,null,null,"-",null,"-","-","-"]
[null,null,null,null,"-",null,"-","-","-"]
[null,null,null,null,"-",null,"-","-","-"]
[null,null,null,null,"-",null,"-","-","-"]
[null,null,null,null,"-",null,"-","-","-"]
[null,null,null,null,"-",null,"-","-","-"]
[null,null,null,null,"-",null,"-","-","-"]
[null,null,null,null,"-",null,"-","-","-"]
[null,null,null,null,"-",null,"-","-","-"]
[null,null,null,null,"-",null,"-","-","-"]
[null,null,null,null,"-",null,"-","-","-"]
[null,null,null,null,"-",null,"-","-","-"]
[null,null,null,null,"-",null,"-","-","-"]
[null,null,null,null,"-",null,"-","-","-"]
[null,null,null,null,"-",null,"-","-","-"]
[null,null,null,null,"-",null,"-","-","-"]
[null,null,null,null,"-",null,"-","-","-"]
[null,null,null,null,"-",null,"-","-","-"]
[null,null,null,null,"-",null,"-","-","-"]

{"sheet":"Mustapha Soussi","index":80,"n_rows":56,"n_cols":9,"rows_kept":56,"cut":false,"hidden":false,"merged":[[12,1,12,8],[15,1,15,4],[16,1,16,4],[17,1,17,4],[18,1,18,4],[18,7,20,8],[19,1,19,4],[20,1,20,4],[30,3,30,5],[21,1,21,4],[21,7,21,8],[22,1,22,4],[23,1,23,4],[24,1,24,4],[27,1,27,8]]}
[]
[]
[]
[]
[]
[]
[]
[]
[]
[]
[]
[]
[null,"Mustapha Soussi"]
[]
[]
[null,"Gespeeld",null,null,null,{"$f":"COUNTIF(G32:G57,\"W\")+COUNTIF(G32:G57,\"G\")+COUNTIF(G32:G57,\"V\")","v":3}]
[null,"Gewonnen",null,null,null,{"$f":"COUNTIF(G32:G57,\"W\")","v":2}]
[null,"Gelijk",null,null,null,{"$f":"COUNTIF(G32:G57,\"G\")","v":0}]
[null,"Verloren",null,null,null,{"$f":"COUNTIF(G32:G57,\"V\")","v":1},null,"Wijk van initiële inschrijving\n(met shirtkleur finaledag)"]
[null,"% gewonnen",null,null,null,{"$f":"IF(F16=0,0,F17/F16)","v":0.66666666666666663}]
[null,"% gelijk",null,null,null,{"$f":"IF(F16=0,0,F18/F16)","v":0}]
[null,"% verloren",null,null,null,{"$f":"IF(F16=0,0,F19/F16)","v":0.33333333333333331},null,"De Schutskamp"]
[null,"Wedstrijdpunten",null,null,null,{"$f":"SUM(H32:H57)","v":6}]
[null,"Saldopunten",null,null,null,{"$f":"SUM(I32:I57)","v":6}]
[null,"Saldopunten per wedstrijd",null,null,null,{"$f":"IF(F16=0,0,F24/F16)","v":2}]
[]
[]
[null,"LET OP: alleen wedstrijden die daadwerkelijk gespeeld zijn in de wijk waarvoor jij je hebt ingeschreven tellen mee!"]
[]
[]
[null,"Datum","Locatie","UITSLAGEN",null,null,"W, V of G?","Wedstrijd-punten","Saldo-punten"]
[null,"2021-07-05","De Schutskamp",13,"-",9,{"$f":"IF(OR($B$13=\"\",wijk_van_inschrijving=\"\"),\"-\",IF(OR(wijk_van_inschrijving<>C32,D32=\"\",F32=\"\"),\"-\",IF(D32>F32,\"W\",IF(D32=F32,\"G\",IF(D32<F32,\"V\",\"-\")))))","v":"W"},{"$f":"IF(OR($B$13=\"\",wijk_van_inschrijving=\"\"),\"-\",IF(OR(wijk_van_inschrijving<>C32,G32=\"-\",G32=\"\"),\"-\",IF(G32=\"W\",3,IF(G32=\"G\",2,IF(G32=\"V\",0,0)))))","v":3},{"$f":"IF(OR($B$13=\"\",wijk_van_inschrijving=\"\"),\"-\",IF(wijk_van_inschrijving<>C32,\"-\",IF(D32>=0,IF(F32=\"\",\"-\",D32-F32))))","v":4}]
[null,"2021-07-05","De Schutskamp",12,"-",8,"W",3,4]
[null,"2021-07-05","De Schutskamp",6,"-",8,"V",0,-2]
[null,null,null,null,"-",null,"-","-","-"]
[null,null,null,null,"-",null,"-","-","-"]
[null,null,null,null,"-",null,"-","-","-"]
[null,null,null,null,"-",null,"-","-","-"]
[null,null,null,null,"-",null,"-","-","-"]
[null,null,null,null,"-",null,"-","-","-"]
[null,null,null,null,"-",null,"-","-","-"]
[null,null,null,null,"-",null,"-","-","-"]
[null,null,null,null,"-",null,"-","-","-"]
[null,null,null,null,"-",null,"-","-","-"]
[null,null,null,null,"-",null,"-","-","-"]
[null,null,null,null,"-",null,"-","-","-"]
[null,null,null,null,"-",null,"-","-","-"]
[null,null,null,null,"-",null,"-","-","-"]
[null,null,null,null,"-",null,"-","-","-"]
[null,null,null,null,"-",null,"-","-","-"]
[null,null,null,null,"-",null,"-","-","-"]
[null,null,null,null,"-",null,"-","-","-"]
[null,null,null,null,"-",null,"-","-","-"]
[null,null,null,null,"-",null,"-","-","-"]
[null,null,null,null,"-",null,"-","-","-"]
[null,null,null,null,"-",null,"-","-","-"]

{"sheet":"Paul van den Merkhof","index":81,"n_rows":56,"n_cols":9,"rows_kept":56,"cut":false,"hidden":false,"merged":[[27,1,27,8],[30,3,30,5],[20,1,20,4],[21,7,21,8],[21,1,21,4],[22,1,22,4],[23,1,23,4],[24,1,24,4],[18,7,20,8],[19,1,19,4],[12,1,12,8],[15,1,15,4],[16,1,16,4],[17,1,17,4],[18,1,18,4]]}
[]
[]
[]
[]
[]
[]
[]
[]
[]
[]
[]
[]
[null,"Paul van den Merkhof"]
[]
[]
[null,"Gespeeld",null,null,null,{"$f":"COUNTIF(G32:G57,\"W\")+COUNTIF(G32:G57,\"G\")+COUNTIF(G32:G57,\"V\")","v":9}]
[null,"Gewonnen",null,null,null,{"$f":"COUNTIF(G32:G57,\"W\")","v":5}]
[null,"Gelijk",null,null,null,{"$f":"COUNTIF(G32:G57,\"G\")","v":0}]
[null,"Verloren",null,null,null,{"$f":"COUNTIF(G32:G57,\"V\")","v":4},null,"Wijk van initiële inschrijving\n(met shirtkleur finaledag)"]
[null,"% gewonnen",null,null,null,{"$f":"IF(F16=0,0,F17/F16)","v":0.55555555555555558}]
[null,"% gelijk",null,null,null,{"$f":"IF(F16=0,0,F18/F16)","v":0}]
[null,"% verloren",null,null,null,{"$f":"IF(F16=0,0,F19/F16)","v":0.44444444444444442},null,"'s-Hertogenbosch Zuid"]
[null,"Wedstrijdpunten",null,null,null,{"$f":"SUM(H32:H57)","v":15}]
[null,"Saldopunten",null,null,null,{"$f":"SUM(I32:I57)","v":16}]
[null,"Saldopunten per wedstrijd",null,null,null,{"$f":"IF(F16=0,0,F24/F16)","v":1.7777777777777777}]
[]
[]
[null,"LET OP: alleen wedstrijden die daadwerkelijk gespeeld zijn in de wijk waarvoor jij je hebt ingeschreven tellen mee!"]
[]
[]
[null,"Datum","Locatie","UITSLAGEN",null,null,"W, V of G?","Wedstrijd-punten","Saldo-punten"]
[null,"2021-06-25","'s-Hertogenbosch Zuid",13,"-",4,{"$f":"IF(OR($B$13=\"\",wijk_van_inschrijving=\"\"),\"-\",IF(OR(wijk_van_inschrijving<>C32,D32=\"\",F32=\"\"),\"-\",IF(D32>F32,\"W\",IF(D32=F32,\"G\",IF(D32<F32,\"V\",\"-\")))))","v":"W"},{"$f":"IF(OR($B$13=\"\",wijk_van_inschrijving=\"\"),\"-\",IF(OR(wijk_van_inschrijving<>C32,G32=\"-\",G32=\"\"),\"-\",IF(G32=\"W\",3,IF(G32=\"G\",2,IF(G32=\"V\",0,0)))))","v":3},{"$f":"IF(OR($B$13=\"\",wijk_van_inschrijving=\"\"),\"-\",IF(wijk_van_inschrijving<>C32,\"-\",IF(D32>=0,IF(F32=\"\",\"-\",D32-F32))))","v":9}]
[null,"2021-06-25","'s-Hertogenbosch Zuid",5,"-",12,"V",0,-7]
[null,"2021-06-25","'s-Hertogenbosch Zuid",13,"-",4,"W",3,9]
[null,"2021-07-01","'s-Hertogenbosch Zuid",13,"-",5,"W",3,8]
[null,"2021-07-01","'s-Hertogenbosch Zuid",5,"-",9,"V",0,-4]
[null,"2021-07-01","'s-Hertogenbosch Zuid",1,"-",13,"V",0,-12]
[null,"2021-07-08","'s-Hertogenbosch Zuid",13,"-",5,"W",3,8]
[null,"2021-07-08","'s-Hertogenbosch Zuid",11,"-",5,"W",3,6]
[null,"2021-07-08","'s-Hertogenbosch Zuid",5,"-",6,"V",0,-1]
[null,null,null,null,"-",null,"-","-","-"]
[null,null,null,null,"-",null,"-","-","-"]
[null,null,null,null,"-",null,"-","-","-"]
[null,null,null,null,"-",null,"-","-","-"]
[null,null,null,null,"-",null,"-","-","-"]
[null,null,null,null,"-",null,"-","-","-"]
[null,null,null,null,"-",null,"-","-","-"]
[null,null,null,null,"-",null,"-","-","-"]
[null,null,null,null,"-",null,"-","-","-"]
[null,null,null,null,"-",null,"-","-","-"]
[null,null,null,null,"-",null,"-","-","-"]
[null,null,null,null,"-",null,"-","-","-"]
[null,null,null,null,"-",null,"-","-","-"]
[null,null,null,null,"-",null,"-","-","-"]
[null,null,null,null,"-",null,"-","-","-"]
[null,null,null,null,"-",null,"-","-","-"]

{"sheet":"Peggy Roelofsen","index":82,"n_rows":56,"n_cols":9,"rows_kept":56,"cut":false,"hidden":false,"merged":[[27,1,27,8],[30,3,30,5],[20,1,20,4],[21,7,21,8],[21,1,21,4],[22,1,22,4],[23,1,23,4],[24,1,24,4],[18,7,20,8],[19,1,19,4],[12,1,12,8],[15,1,15,4],[16,1,16,4],[17,1,17,4],[18,1,18,4]]}
[]
[]
[]
[]
[]
[]
[]
[]
[]
[]
[]
[]
[null,"Peggy Roelofsen"]
[]
[]
[null,"Gespeeld",null,null,null,{"$f":"COUNTIF(G32:G57,\"W\")+COUNTIF(G32:G57,\"G\")+COUNTIF(G32:G57,\"V\")","v":3}]
[null,"Gewonnen",null,null,null,{"$f":"COUNTIF(G32:G57,\"W\")","v":2}]
[null,"Gelijk",null,null,null,{"$f":"COUNTIF(G32:G57,\"G\")","v":0}]
[null,"Verloren",null,null,null,{"$f":"COUNTIF(G32:G57,\"V\")","v":1},null,"Wijk van initiële inschrijving\n(met shirtkleur finaledag)"]
[null,"% gewonnen",null,null,null,{"$f":"IF(F16=0,0,F17/F16)","v":0.66666666666666663}]
[null,"% gelijk",null,null,null,{"$f":"IF(F16=0,0,F18/F16)","v":0}]
[null,"% verloren",null,null,null,{"$f":"IF(F16=0,0,F19/F16)","v":0.33333333333333331},null,"De Schutskamp"]
[null,"Wedstrijdpunten",null,null,null,{"$f":"SUM(H32:H57)","v":6}]
[null,"Saldopunten",null,null,null,{"$f":"SUM(I32:I57)","v":5}]
[null,"Saldopunten per wedstrijd",null,null,null,{"$f":"IF(F16=0,0,F24/F16)","v":1.6666666666666667}]
[]
[]
[null,"LET OP: alleen wedstrijden die daadwerkelijk gespeeld zijn in de wijk waarvoor jij je hebt ingeschreven tellen mee!"]
[]
[]
[null,"Datum","Locatie","UITSLAGEN",null,null,"W, V of G?","Wedstrijd-punten","Saldo-punten"]
[null,"2021-06-28","De Schutskamp",4,"-",8,{"$f":"IF(OR($B$13=\"\",wijk_van_inschrijving=\"\"),\"-\",IF(OR(wijk_van_inschrijving<>C32,D32=\"\",F32=\"\"),\"-\",IF(D32>F32,\"W\",IF(D32=F32,\"G\",IF(D32<F32,\"V\",\"-\")))))","v":"V"},{"$f":"IF(OR($B$13=\"\",wijk_van_inschrijving=\"\"),\"-\",IF(OR(wijk_van_inschrijving<>C32,G32=\"-\",G32=\"\"),\"-\",IF(G32=\"W\",3,IF(G32=\"G\",2,IF(G32=\"V\",0,0)))))","v":0},{"$f":"IF(OR($B$13=\"\",wijk_van_inschrijving=\"\"),\"-\",IF(wijk_van_inschrijving<>C32,\"-\",IF(D32>=0,IF(F32=\"\",\"-\",D32-F32))))","v":-4}]
[null,"2021-06-28","De Schutskamp",10,"-",7,"W",3,3]
[null,"2021-06-28","De Schutskamp",7,"-",1,"W",3,6]
[null,null,null,null,"-",null,"-","-","-"]
[null,null,null,null,"-",null,"-","-","-"]
[null,null,null,null,"-",null,"-","-","-"]
[null,null,null,null,"-",null,"-","-","-"]
[null,null,null,null,"-",null,"-","-","-"]
[null,null,null,null,"-",null,"-","-","-"]
[null,null,null,null,"-",null,"-","-","-"]
[null,null,null,null,"-",null,"-","-","-"]
[null,null,null,null,"-",null,"-","-","-"]
[null,null,null,null,"-",null,"-","-","-"]
[null,null,null,null,"-",null,"-","-","-"]
[null,null,null,null,"-",null,"-","-","-"]
[null,null,null,null,"-",null,"-","-","-"]
[null,null,null,null,"-",null,"-","-","-"]
[null,null,null,null,"-",null,"-","-","-"]
[null,null,null,null,"-",null,"-","-","-"]
[null,null,null,null,"-",null,"-","-","-"]
[null,null,null,null,"-",null,"-","-","-"]
[null,null,null,null,"-",null,"-","-","-"]
[null,null,null,null,"-",null,"-","-","-"]
[null,null,null,null,"-",null,"-","-","-"]
[null,null,null,null,"-",null,"-","-","-"]

{"sheet":"Pepijn de Leeuwen","index":83,"n_rows":56,"n_cols":9,"rows_kept":56,"cut":false,"hidden":false,"merged":[[27,1,27,8],[30,3,30,5],[20,1,20,4],[21,7,21,8],[21,1,21,4],[22,1,22,4],[23,1,23,4],[24,1,24,4],[18,7,20,8],[19,1,19,4],[12,1,12,8],[15,1,15,4],[16,1,16,4],[17,1,17,4],[18,1,18,4]]}
[]
[]
[]
[]
[]
[]
[]
[]
[]
[]
[]
[]
[null,"Pepijn de Leeuwen"]
[]
[]
[null,"Gespeeld",null,null,null,{"$f":"COUNTIF(G32:G57,\"W\")+COUNTIF(G32:G57,\"G\")+COUNTIF(G32:G57,\"V\")","v":2}]
[null,"Gewonnen",null,null,null,{"$f":"COUNTIF(G32:G57,\"W\")","v":1}]
[null,"Gelijk",null,null,null,{"$f":"COUNTIF(G32:G57,\"G\")","v":0}]
[null,"Verloren",null,null,null,{"$f":"COUNTIF(G32:G57,\"V\")","v":1},null,"Wijk van initiële inschrijving\n(met shirtkleur finaledag)"]
[null,"% gewonnen",null,null,null,{"$f":"IF(F16=0,0,F17/F16)","v":0.5}]
[null,"% gelijk",null,null,null,{"$f":"IF(F16=0,0,F18/F16)","v":0}]
[null,"% verloren",null,null,null,{"$f":"IF(F16=0,0,F19/F16)","v":0.5},null,"Hondsberg (Rosmalen)"]
[null,"Wedstrijdpunten",null,null,null,{"$f":"SUM(H32:H57)","v":3}]
[null,"Saldopunten",null,null,null,{"$f":"SUM(I32:I57)","v":-5}]
[null,"Saldopunten per wedstrijd",null,null,null,{"$f":"IF(F16=0,0,F24/F16)","v":-2.5}]
[]
[]
[null,"LET OP: alleen wedstrijden die daadwerkelijk gespeeld zijn in de wijk waarvoor jij je hebt ingeschreven tellen mee!"]
[]
[]
[null,"Datum","Locatie","UITSLAGEN",null,null,"W, V of G?","Wedstrijd-punten","Saldo-punten"]
[null,"2021-06-22","Hondsberg (Rosmalen)",9,"-",7,{"$f":"IF(OR($B$13=\"\",wijk_van_inschrijving=\"\"),\"-\",IF(OR(wijk_van_inschrijving<>C32,D32=\"\",F32=\"\"),\"-\",IF(D32>F32,\"W\",IF(D32=F32,\"G\",IF(D32<F32,\"V\",\"-\")))))","v":"W"},{"$f":"IF(OR($B$13=\"\",wijk_van_inschrijving=\"\"),\"-\",IF(OR(wijk_van_inschrijving<>C32,G32=\"-\",G32=\"\"),\"-\",IF(G32=\"W\",3,IF(G32=\"G\",2,IF(G32=\"V\",0,0)))))","v":3},{"$f":"IF(OR($B$13=\"\",wijk_van_inschrijving=\"\"),\"-\",IF(wijk_van_inschrijving<>C32,\"-\",IF(D32>=0,IF(F32=\"\",\"-\",D32-F32))))","v":2}]
[null,"2021-06-22","Hondsberg (Rosmalen)",6,"-",13,"V",0,-7]
[null,null,null,null,"-",null,"-","-","-"]
[null,null,null,null,"-",null,"-","-","-"]
[null,null,null,null,"-",null,"-","-","-"]
[null,null,null,null,"-",null,"-","-","-"]
[null,null,null,null,"-",null,"-","-","-"]
[null,null,null,null,"-",null,"-","-","-"]
[null,null,null,null,"-",null,"-","-","-"]
[null,null,null,null,"-",null,"-","-","-"]
[null,null,null,null,"-",null,"-","-","-"]
[null,null,null,null,"-",null,"-","-","-"]
[null,null,null,null,"-",null,"-","-","-"]
[null,null,null,null,"-",null,"-","-","-"]
[null,null,null,null,"-",null,"-","-","-"]
[null,null,null,null,"-",null,"-","-","-"]
[null,null,null,null,"-",null,"-","-","-"]
[null,null,null,null,"-",null,"-","-","-"]
[null,null,null,null,"-",null,"-","-","-"]
[null,null,null,null,"-",null,"-","-","-"]
[null,null,null,null,"-",null,"-","-","-"]
[null,null,null,null,"-",null,"-","-","-"]
[null,null,null,null,"-",null,"-","-","-"]
[null,null,null,null,"-",null,"-","-","-"]
[null,null,null,null,"-",null,"-","-","-"]

{"sheet":"Peter Ondersteijn","index":84,"n_rows":56,"n_cols":9,"rows_kept":56,"cut":false,"hidden":false,"merged":[[27,1,27,8],[30,3,30,5],[20,1,20,4],[21,7,21,8],[21,1,21,4],[22,1,22,4],[23,1,23,4],[24,1,24,4],[18,7,20,8],[19,1,19,4],[12,1,12,8],[15,1,15,4],[16,1,16,4],[17,1,17,4],[18,1,18,4]]}
[]
[]
[]
[]
[]
[]
[]
[]
[]
[]
[]
[]
[null,"Peter Ondersteijn"]
[]
[]
[null,"Gespeeld",null,null,null,{"$f":"COUNTIF(G32:G57,\"W\")+COUNTIF(G32:G57,\"G\")+COUNTIF(G32:G57,\"V\")","v":9}]
[null,"Gewonnen",null,null,null,{"$f":"COUNTIF(G32:G57,\"W\")","v":5}]
[null,"Gelijk",null,null,null,{"$f":"COUNTIF(G32:G57,\"G\")","v":1}]
[null,"Verloren",null,null,null,{"$f":"COUNTIF(G32:G57,\"V\")","v":3},null,"Wijk van initiële inschrijving\n(met shirtkleur finaledag)"]
[null,"% gewonnen",null,null,null,{"$f":"IF(F16=0,0,F17/F16)","v":0.55555555555555558}]
[null,"% gelijk",null,null,null,{"$f":"IF(F16=0,0,F18/F16)","v":0.1111111111111111}]
[null,"% verloren",null,null,null,{"$f":"IF(F16=0,0,F19/F16)","v":0.33333333333333331},null,"'s-Hertogenbosch Zuid"]
[null,"Wedstrijdpunten",null,null,null,{"$f":"SUM(H32:H57)","v":17}]
[null,"Saldopunten",null,null,null,{"$f":"SUM(I32:I57)","v":4}]
[null,"Saldopunten per wedstrijd",null,null,null,{"$f":"IF(F16=0,0,F24/F16)","v":0.44444444444444442}]
[]
[]
[null,"LET OP: alleen wedstrijden die daadwerkelijk gespeeld zijn in de wijk waarvoor jij je hebt ingeschreven tellen mee!"]
[]
[]
[null,"Datum","Locatie","UITSLAGEN",null,null,"W, V of G?","Wedstrijd-punten","Saldo-punten"]
[null,"2021-06-25","'s-Hertogenbosch Zuid",8,"-",5,{"$f":"IF(OR($B$13=\"\",wijk_van_inschrijving=\"\"),\"-\",IF(OR(wijk_van_inschrijving<>C32,D32=\"\",F32=\"\"),\"-\",IF(D32>F32,\"W\",IF(D32=F32,\"G\",IF(D32<F32,\"V\",\"-\")))))","v":"W"},{"$f":"IF(OR($B$13=\"\",wijk_van_inschrijving=\"\"),\"-\",IF(OR(wijk_van_inschrijving<>C32,G32=\"-\",G32=\"\"),\"-\",IF(G32=\"W\",3,IF(G32=\"G\",2,IF(G32=\"V\",0,0)))))","v":3},{"$f":"IF(OR($B$13=\"\",wijk_van_inschrijving=\"\"),\"-\",IF(wijk_van_inschrijving<>C32,\"-\",IF(D32>=0,IF(F32=\"\",\"-\",D32-F32))))","v":3}]
[null,"2021-06-25","'s-Hertogenbosch Zuid",5,"-",12,"V",0,-7]
[null,"2021-06-25","'s-Hertogenbosch Zuid",4,"-",9,"V",0,-5]
[null,"2021-07-01","'s-Hertogenbosch Zuid",7,"-",7,"G",2,0]
[null,"2021-07-01","'s-Hertogenbosch Zuid",9,"-",5,"W",3,4]
[null,"2021-07-01","'s-Hertogenbosch Zuid",9,"-",8,"W",3,1]
[null,"2021-07-08","'s-Hertogenbosch Zuid",11,"-",3,"W",3,8]
[null,"2021-07-08","'s-Hertogenbosch Zuid",8,"-",7,"W",3,1]
[null,"2021-07-08","'s-Hertogenbosch Zuid",5,"-",6,"V",0,-1]
[null,null,null,null,"-",null,"-","-","-"]
[null,null,null,null,"-",null,"-","-","-"]
[null,null,null,null,"-",null,"-","-","-"]
[null,null,null,null,"-",null,"-","-","-"]
[null,null,null,null,"-",null,"-","-","-"]
[null,null,null,null,"-",null,"-","-","-"]
[null,null,null,null,"-",null,"-","-","-"]
[null,null,null,null,"-",null,"-","-","-"]
[null,null,null,null,"-",null,"-","-","-"]
[null,null,null,null,"-",null,"-","-","-"]
[null,null,null,null,"-",null,"-","-","-"]
[null,null,null,null,"-",null,"-","-","-"]
[null,null,null,null,"-",null,"-","-","-"]
[null,null,null,null,"-",null,"-","-","-"]
[null,null,null,null,"-",null,"-","-","-"]
[null,null,null,null,"-",null,"-","-","-"]

{"sheet":"Petra Schepers","index":85,"n_rows":56,"n_cols":9,"rows_kept":56,"cut":false,"hidden":false,"merged":[[18,7,20,8],[30,3,30,5],[12,1,12,8],[15,1,15,4],[16,1,16,4],[17,1,17,4],[18,1,18,4],[19,1,19,4],[20,1,20,4],[21,1,21,4],[22,1,22,4],[23,1,23,4],[24,1,24,4],[21,7,21,8],[27,1,27,8]]}
[]
[]
[]
[]
[]
[]
[]
[]
[]
[]
[]
[]
[null,"Petra Schepers"]
[]
[]
[null,"Gespeeld",null,null,null,{"$f":"COUNTIF(G32:G57,\"W\")+COUNTIF(G32:G57,\"G\")+COUNTIF(G32:G57,\"V\")","v":3}]
[null,"Gewonnen",null,null,null,{"$f":"COUNTIF(G32:G57,\"W\")","v":1}]
[null,"Gelijk",null,null,null,{"$f":"COUNTIF(G32:G57,\"G\")","v":1}]
[null,"Verloren",null,null,null,{"$f":"COUNTIF(G32:G57,\"V\")","v":1},null,"Wijk van initiële inschrijving\n(met shirtkleur finaledag)"]
[null,"% gewonnen",null,null,null,{"$f":"IF(F16=0,0,F17/F16)","v":0.33333333333333331}]
[null,"% gelijk",null,null,null,{"$f":"IF(F16=0,0,F18/F16)","v":0.33333333333333331}]
[null,"% verloren",null,null,null,{"$f":"IF(F16=0,0,F19/F16)","v":0.33333333333333331},null,"'s-Hertogenbosch Zuid"]
[null,"Wedstrijdpunten",null,null,null,{"$f":"SUM(H32:H57)","v":5}]
[null,"Saldopunten",null,null,null,{"$f":"SUM(I32:I57)","v":8}]
[null,"Saldopunten per wedstrijd",null,null,null,{"$f":"IF(F16=0,0,F24/F16)","v":2.6666666666666665}]
[]
[]
[null,"LET OP: alleen wedstrijden die daadwerkelijk gespeeld zijn in de wijk waarvoor jij je hebt ingeschreven tellen mee!"]
[]
[]
[null,"Datum","Locatie","UITSLAGEN",null,null,"W, V of G?","Wedstrijd-punten","Saldo-punten"]
[null,"2021-06-18","'s-Hertogenbosch Zuid",13,"-",4,{"$f":"IF(OR($B$13=\"\",wijk_van_inschrijving=\"\"),\"-\",IF(OR(wijk_van_inschrijving<>C32,D32=\"\",F32=\"\"),\"-\",IF(D32>F32,\"W\",IF(D32=F32,\"G\",IF(D32<F32,\"V\",\"-\")))))","v":"W"},{"$f":"IF(OR($B$13=\"\",wijk_van_inschrijving=\"\"),\"-\",IF(OR(wijk_van_inschrijving<>C32,G32=\"-\",G32=\"\"),\"-\",IF(G32=\"W\",3,IF(G32=\"G\",2,IF(G32=\"V\",0,0)))))","v":3},{"$f":"IF(OR($B$13=\"\",wijk_van_inschrijving=\"\"),\"-\",IF(wijk_van_inschrijving<>C32,\"-\",IF(D32>=0,IF(F32=\"\",\"-\",D32-F32))))","v":9}]
[null,"2021-06-18","'s-Hertogenbosch Zuid",4,"-",4,"G",2,0]
[null,"2021-06-18","'s-Hertogenbosch Zuid",10,"-",11,"V",0,-1]
[null,null,null,null,"-",null,"-","-","-"]
[null,null,null,null,"-",null,"-","-","-"]
[null,null,null,null,"-",null,"-","-","-"]
[null,null,null,null,"-",null,"-","-","-"]
[null,null,null,null,"-",null,"-","-","-"]
[null,null,null,null,"-",null,"-","-","-"]
[null,null,null,null,"-",null,"-","-","-"]
[null,null,null,null,"-",null,"-","-","-"]
[null,null,null,null,"-",null,"-","-","-"]
[null,null,null,null,"-",null,"-","-","-"]
[null,null,null,null,"-",null,"-","-","-"]
[null,null,null,null,"-",null,"-","-","-"]
[null,null,null,null,"-",null,"-","-","-"]
[null,null,null,null,"-",null,"-","-","-"]
[null,null,null,null,"-",null,"-","-","-"]
[null,null,null,null,"-",null,"-","-","-"]
[null,null,null,null,"-",null,"-","-","-"]
[null,null,null,null,"-",null,"-","-","-"]
[null,null,null,null,"-",null,"-","-","-"]
[null,null,null,null,"-",null,"-","-","-"]
[null,null,null,null,"-",null,"-","-","-"]
[null,null,null,null,"-",null,"-","-","-"]

{"sheet":"Phil Roothans","index":86,"n_rows":56,"n_cols":9,"rows_kept":56,"cut":false,"hidden":false,"merged":[[27,1,27,8],[30,3,30,5],[20,1,20,4],[21,7,21,8],[21,1,21,4],[22,1,22,4],[23,1,23,4],[24,1,24,4],[18,7,20,8],[19,1,19,4],[12,1,12,8],[15,1,15,4],[16,1,16,4],[17,1,17,4],[18,1,18,4]]}
[]
[]
[]
[]
[]
[]
[]
[]
[]
[]
[]
[]
[null,"Phil Roothans"]
[]
[]
[null,"Gespeeld",null,null,null,{"$f":"COUNTIF(G32:G57,\"W\")+COUNTIF(G32:G57,\"G\")+COUNTIF(G32:G57,\"V\")","v":2}]
[null,"Gewonnen",null,null,null,{"$f":"COUNTIF(G32:G57,\"W\")","v":1}]
[null,"Gelijk",null,null,null,{"$f":"COUNTIF(G32:G57,\"G\")","v":0}]
[null,"Verloren",null,null,null,{"$f":"COUNTIF(G32:G57,\"V\")","v":1},null,"Wijk van initiële inschrijving\n(met shirtkleur finaledag)"]
[null,"% gewonnen",null,null,null,{"$f":"IF(F16=0,0,F17/F16)","v":0.5}]
[null,"% gelijk",null,null,null,{"$f":"IF(F16=0,0,F18/F16)","v":0}]
[null,"% verloren",null,null,null,{"$f":"IF(F16=0,0,F19/F16)","v":0.5},null,"De Hambaken"]
[null,"Wedstrijdpunten",null,null,null,{"$f":"SUM(H32:H57)","v":3}]
[null,"Saldopunten",null,null,null,{"$f":"SUM(I32:I57)","v":-4}]
[null,"Saldopunten per wedstrijd",null,null,null,{"$f":"IF(F16=0,0,F24/F16)","v":-2}]
[]
[]
[null,"LET OP: alleen wedstrijden die daadwerkelijk gespeeld zijn in de wijk waarvoor jij je hebt ingeschreven tellen mee!"]
[]
[]
[null,"Datum","Locatie","UITSLAGEN",null,null,"W, V of G?","Wedstrijd-punten","Saldo-punten"]
[null,"2021-06-16","De Hambaken",4,"-",9,{"$f":"IF(OR($B$13=\"\",wijk_van_inschrijving=\"\"),\"-\",IF(OR(wijk_van_inschrijving<>C32,D32=\"\",F32=\"\"),\"-\",IF(D32>F32,\"W\",IF(D32=F32,\"G\",IF(D32<F32,\"V\",\"-\")))))","v":"V"},{"$f":"IF(OR($B$13=\"\",wijk_van_inschrijving=\"\"),\"-\",IF(OR(wijk_van_inschrijving<>C32,G32=\"-\",G32=\"\"),\"-\",IF(G32=\"W\",3,IF(G32=\"G\",2,IF(G32=\"V\",0,0)))))","v":0},{"$f":"IF(OR($B$13=\"\",wijk_van_inschrijving=\"\"),\"-\",IF(wijk_van_inschrijving<>C32,\"-\",IF(D32>=0,IF(F32=\"\",\"-\",D32-F32))))","v":-5}]
[null,"2021-06-16","De Hambaken",7,"-",6,"W",3,1]
[null,"2021-06-24","De Schutskamp",6,"-",10,"-","-","-"]
[null,"2021-06-24","De Schutskamp",6,"-",9,"-","-","-"]
[null,"2021-06-24","De Schutskamp",11,"-",7,"-","-","-"]
[null,"2021-07-08","'s-Hertogenbosch Zuid",1,"-",13,"-","-","-"]
[null,"2021-07-08","'s-Hertogenbosch Zuid",6,"-",5,"-","-","-"]
[null,null,null,null,"-",null,"-","-","-"]
[null,null,null,null,"-",null,"-","-","-"]
[null,null,null,null,"-",null,"-","-","-"]
[null,null,null,null,"-",null,"-","-","-"]
[null,null,null,null,"-",null,"-","-","-"]
[null,null,null,null,"-",null,"-","-","-"]
[null,null,null,null,"-",null,"-","-","-"]
[null,null,null,null,"-",null,"-","-","-"]
[null,null,null,null,"-",null,"-","-","-"]
[null,null,null,null,"-",null,"-","-","-"]
[null,null,null,null,"-",null,"-","-","-"]
[null,null,null,null,"-",null,"-","-","-"]
[null,null,null,null,"-",null,"-","-","-"]
[null,null,null,null,"-",null,"-","-","-"]
[null,null,null,null,"-",null,"-","-","-"]
[null,null,null,null,"-",null,"-","-","-"]
[null,null,null,null,"-",null,"-","-","-"]
[null,null,null,null,"-",null,"-","-","-"]

{"sheet":"Pierre Kisters","index":87,"n_rows":56,"n_cols":9,"rows_kept":56,"cut":false,"hidden":false,"merged":[[18,7,20,8],[30,3,30,5],[12,1,12,8],[15,1,15,4],[16,1,16,4],[17,1,17,4],[18,1,18,4],[19,1,19,4],[20,1,20,4],[21,1,21,4],[22,1,22,4],[23,1,23,4],[24,1,24,4],[21,7,21,8],[27,1,27,8]]}
[]
[]
[]
[]
[]
[]
[]
[]
[]
[]
[]
[]
[null,"Pierre Kisters"]
[]
[]
[null,"Gespeeld",null,null,null,{"$f":"COUNTIF(G32:G57,\"W\")+COUNTIF(G32:G57,\"G\")+COUNTIF(G32:G57,\"V\")","v":11}]
[null,"Gewonnen",null,null,null,{"$f":"COUNTIF(G32:G57,\"W\")","v":5}]
[null,"Gelijk",null,null,null,{"$f":"COUNTIF(G32:G57,\"G\")","v":1}]
[null,"Verloren",null,null,null,{"$f":"COUNTIF(G32:G57,\"V\")","v":5},null,"Wijk van initiële inschrijving\n(met shirtkleur finaledag)"]
[null,"% gewonnen",null,null,null,{"$f":"IF(F16=0,0,F17/F16)","v":0.45454545454545453}]
[null,"% gelijk",null,null,null,{"$f":"IF(F16=0,0,F18/F16)","v":9.0909090909090912E-2}]
[null,"% verloren",null,null,null,{"$f":"IF(F16=0,0,F19/F16)","v":0.45454545454545453},null,"Hondsberg (Rosmalen)"]
[null,"Wedstrijdpunten",null,null,null,{"$f":"SUM(H32:H57)","v":17}]
[null,"Saldopunten",null,null,null,{"$f":"SUM(I32:I57)","v":-2}]
[null,"Saldopunten per wedstrijd",null,null,null,{"$f":"IF(F16=0,0,F24/F16)","v":-0.18181818181818182}]
[]
[]
[null,"LET OP: alleen wedstrijden die daadwerkelijk gespeeld zijn in de wijk waarvoor jij je hebt ingeschreven tellen mee!"]
[]
[]
[null,"Datum","Locatie","UITSLAGEN",null,null,"W, V of G?","Wedstrijd-punten","Saldo-punten"]
[null,"2021-06-15","Hondsberg (Rosmalen)",2,"-",12,{"$f":"IF(OR($B$13=\"\",wijk_van_inschrijving=\"\"),\"-\",IF(OR(wijk_van_inschrijving<>C32,D32=\"\",F32=\"\"),\"-\",IF(D32>F32,\"W\",IF(D32=F32,\"G\",IF(D32<F32,\"V\",\"-\")))))","v":"V"},{"$f":"IF(OR($B$13=\"\",wijk_van_inschrijving=\"\"),\"-\",IF(OR(wijk_van_inschrijving<>C32,G32=\"-\",G32=\"\"),\"-\",IF(G32=\"W\",3,IF(G32=\"G\",2,IF(G32=\"V\",0,0)))))","v":0},{"$f":"IF(OR($B$13=\"\",wijk_van_inschrijving=\"\"),\"-\",IF(wijk_van_inschrijving<>C32,\"-\",IF(D32>=0,IF(F32=\"\",\"-\",D32-F32))))","v":-10}]
[null,"2021-06-15","Hondsberg (Rosmalen)",6,"-",6,"G",2,0]
[null,"2021-06-15","Hondsberg (Rosmalen)",13,"-",5,"W",3,8]
[null,"2021-06-22","Hondsberg (Rosmalen)",10,"-",4,"W",3,6]
[null,"2021-06-22","Hondsberg (Rosmalen)",13,"-",6,"W",3,7]
[null,"2021-06-30","Hondsberg (Rosmalen)",5,"-",13,"V",0,-8]
[null,"2021-06-30","Hondsberg (Rosmalen)",12,"-",0,"W",3,12]
[null,"2021-06-30","Hondsberg (Rosmalen)",5,"-",13,"V",0,-8]
[null,"2021-07-07","Hondsberg (Rosmalen)",5,"-",12,"V",0,-7]
[null,"2021-07-07","Hondsberg (Rosmalen)",10,"-",6,"W",3,4]
[null,"2021-07-07","Hondsberg (Rosmalen)",1,"-",7,"V",0,-6]
[null,null,null,null,"-",null,"-","-","-"]
[null,null,null,null,"-",null,"-","-","-"]
[null,null,null,null,"-",null,"-","-","-"]
[null,null,null,null,"-",null,"-","-","-"]
[null,null,null,null,"-",null,"-","-","-"]
[null,null,null,null,"-",null,"-","-","-"]
[null,null,null,null,"-",null,"-","-","-"]
[null,null,null,null,"-",null,"-","-","-"]
[null,null,null,null,"-",null,"-","-","-"]
[null,null,null,null,"-",null,"-","-","-"]
[null,null,null,null,"-",null,"-","-","-"]
[null,null,null,null,"-",null,"-","-","-"]
[null,null,null,null,"-",null,"-","-","-"]
[null,null,null,null,"-",null,"-","-","-"]

{"sheet":"Raymond Nijsten","index":88,"n_rows":56,"n_cols":9,"rows_kept":56,"cut":false,"hidden":false,"merged":[[27,1,27,8],[30,3,30,5],[20,1,20,4],[21,7,21,8],[21,1,21,4],[22,1,22,4],[23,1,23,4],[24,1,24,4],[18,7,20,8],[19,1,19,4],[12,1,12,8],[15,1,15,4],[16,1,16,4],[17,1,17,4],[18,1,18,4]]}
[]
[]
[]
[]
[]
[]
[]
[]
[]
[]
[]
[]
[null,"Raymond Nijsten"]
[]
[]
[null,"Gespeeld",null,null,null,{"$f":"COUNTIF(G32:G57,\"W\")+COUNTIF(G32:G57,\"G\")+COUNTIF(G32:G57,\"V\")","v":9}]
[null,"Gewonnen",null,null,null,{"$f":"COUNTIF(G32:G57,\"W\")","v":3}]
[null,"Gelijk",null,null,null,{"$f":"COUNTIF(G32:G57,\"G\")","v":0}]
[null,"Verloren",null,null,null,{"$f":"COUNTIF(G32:G57,\"V\")","v":6},null,"Wijk van initiële inschrijving\n(met shirtkleur finaledag)"]
[null,"% gewonnen",null,null,null,{"$f":"IF(F16=0,0,F17/F16)","v":0.33333333333333331}]
[null,"% gelijk",null,null,null,{"$f":"IF(F16=0,0,F18/F16)","v":0}]
[null,"% verloren",null,null,null,{"$f":"IF(F16=0,0,F19/F16)","v":0.66666666666666663},null,"De Schutskamp"]
[null,"Wedstrijdpunten",null,null,null,{"$f":"SUM(H32:H57)","v":9}]
[null,"Saldopunten",null,null,null,{"$f":"SUM(I32:I57)","v":-27}]
[null,"Saldopunten per wedstrijd",null,null,null,{"$f":"IF(F16=0,0,F24/F16)","v":-3}]
[]
[]
[null,"LET OP: alleen wedstrijden die daadwerkelijk gespeeld zijn in de wijk waarvoor jij je hebt ingeschreven tellen mee!"]
[]
[]
[null,"Datum","Locatie","UITSLAGEN",null,null,"W, V of G?","Wedstrijd-punten","Saldo-punten"]
[null,"2021-06-24","De Schutskamp",10,"-",6,{"$f":"IF(OR($B$13=\"\",wijk_van_inschrijving=\"\"),\"-\",IF(OR(wijk_van_inschrijving<>C32,D32=\"\",F32=\"\"),\"-\",IF(D32>F32,\"W\",IF(D32=F32,\"G\",IF(D32<F32,\"V\",\"-\")))))","v":"W"},{"$f":"IF(OR($B$13=\"\",wijk_van_inschrijving=\"\"),\"-\",IF(OR(wijk_van_inschrijving<>C32,G32=\"-\",G32=\"\"),\"-\",IF(G32=\"W\",3,IF(G32=\"G\",2,IF(G32=\"V\",0,0)))))","v":3},{"$f":"IF(OR($B$13=\"\",wijk_van_inschrijving=\"\"),\"-\",IF(wijk_van_inschrijving<>C32,\"-\",IF(D32>=0,IF(F32=\"\",\"-\",D32-F32))))","v":4}]
[null,"2021-06-24","De Schutskamp",1,"-",13,"V",0,-12]
[null,"2021-06-24","De Schutskamp",12,"-",8,"W",3,4]
[null,"2021-06-28","De Schutskamp",5,"-",13,"V",0,-8]
[null,"2021-06-28","De Schutskamp",7,"-",8,"V",0,-1]
[null,"2021-06-28","De Schutskamp",12,"-",6,"W",3,6]
[null,"2021-07-05","De Schutskamp",6,"-",13,"V",0,-7]
[null,"2021-07-05","De Schutskamp",6,"-",13,"V",0,-7]
[null,"2021-07-05","De Schutskamp",3,"-",9,"V",0,-6]
[null,null,null,null,"-",null,"-","-","-"]
[null,null,null,null,"-",null,"-","-","-"]
[null,null,null,null,"-",null,"-","-","-"]
[null,null,null,null,"-",null,"-","-","-"]
[null,null,null,null,"-",null,"-","-","-"]
[null,null,null,null,"-",null,"-","-","-"]
[null,null,null,null,"-",null,"-","-","-"]
[null,null,null,null,"-",null,"-","-","-"]
[null,null,null,null,"-",null,"-","-","-"]
[null,null,null,null,"-",null,"-","-","-"]
[null,null,null,null,"-",null,"-","-","-"]
[null,null,null,null,"-",null,"-","-","-"]
[null,null,null,null,"-",null,"-","-","-"]
[null,null,null,null,"-",null,"-","-","-"]
[null,null,null,null,"-",null,"-","-","-"]
[null,null,null,null,"-",null,"-","-","-"]

{"sheet":"Ria de Kort","index":89,"n_rows":56,"n_cols":9,"rows_kept":56,"cut":false,"hidden":false,"merged":[[18,7,20,8],[30,3,30,5],[12,1,12,8],[15,1,15,4],[16,1,16,4],[17,1,17,4],[18,1,18,4],[19,1,19,4],[20,1,20,4],[21,1,21,4],[22,1,22,4],[23,1,23,4],[24,1,24,4],[21,7,21,8],[27,1,27,8]]}
[]
[]
[]
[]
[]
[]
[]
[]
[]
[]
[]
[]
[null,"Ria de Kort"]
[]
[]
[null,"Gespeeld",null,null,null,{"$f":"COUNTIF(G32:G57,\"W\")+COUNTIF(G32:G57,\"G\")+COUNTIF(G32:G57,\"V\")","v":10}]
[null,"Gewonnen",null,null,null,{"$f":"COUNTIF(G32:G57,\"W\")","v":5}]
[null,"Gelijk",null,null,null,{"$f":"COUNTIF(G32:G57,\"G\")","v":1}]
[null,"Verloren",null,null,null,{"$f":"COUNTIF(G32:G57,\"V\")","v":4},null,"Wijk van initiële inschrijving\n(met shirtkleur finaledag)"]
[null,"% gewonnen",null,null,null,{"$f":"IF(F16=0,0,F17/F16)","v":0.5}]
[null,"% gelijk",null,null,null,{"$f":"IF(F16=0,0,F18/F16)","v":0.1}]
[null,"% verloren",null,null,null,{"$f":"IF(F16=0,0,F19/F16)","v":0.4},null,"Hondsberg (Rosmalen)"]
[null,"Wedstrijdpunten",null,null,null,{"$f":"SUM(H32:H57)","v":17}]
[null,"Saldopunten",null,null,null,{"$f":"SUM(I32:I57)","v":-7}]
[null,"Saldopunten per wedstrijd",null,null,null,{"$f":"IF(F16=0,0,F24/F16)","v":-0.7}]
[]
[]
[null,"LET OP: alleen wedstrijden die daadwerkelijk gespeeld zijn in de wijk waarvoor jij je hebt ingeschreven tellen mee!"]
[]
[]
[null,"Datum","Locatie","UITSLAGEN",null,null,"W, V of G?","Wedstrijd-punten","Saldo-punten"]
[null,"2021-06-15","Hondsberg (Rosmalen)",2,"-",12,{"$f":"IF(OR($B$13=\"\",wijk_van_inschrijving=\"\"),\"-\",IF(OR(wijk_van_inschrijving<>C32,D32=\"\",F32=\"\"),\"-\",IF(D32>F32,\"W\",IF(D32=F32,\"G\",IF(D32<F32,\"V\",\"-\")))))","v":"V"},{"$f":"IF(OR($B$13=\"\",wijk_van_inschrijving=\"\"),\"-\",IF(OR(wijk_van_inschrijving<>C32,G32=\"-\",G32=\"\"),\"-\",IF(G32=\"W\",3,IF(G32=\"G\",2,IF(G32=\"V\",0,0)))))","v":0},{"$f":"IF(OR($B$13=\"\",wijk_van_inschrijving=\"\"),\"-\",IF(wijk_van_inschrijving<>C32,\"-\",IF(D32>=0,IF(F32=\"\",\"-\",D32-F32))))","v":-10}]
[null,"2021-06-15","Hondsberg (Rosmalen)",8,"-",6,"W",3,2]
[null,"2021-06-15","Hondsberg (Rosmalen)",8,"-",8,"G",2,0]
[null,"2021-06-22","Hondsberg (Rosmalen)",11,"-",2,"W",3,9]
[null,"2021-06-22","Hondsberg (Rosmalen)",3,"-",7,"V",0,-4]
[null,"2021-06-30","Hondsberg (Rosmalen)",2,"-",13,"V",0,-11]
[null,"2021-06-30","Hondsberg (Rosmalen)",7,"-",6,"W",3,1]
[null,"2021-07-07","Hondsberg (Rosmalen)",5,"-",3,"W",3,2]
[null,"2021-07-07","Hondsberg (Rosmalen)",6,"-",10,"V",0,-4]
[null,"2021-07-07","Hondsberg (Rosmalen)",11,"-",3,"W",3,8]
[null,null,null,null,"-",null,"-","-","-"]
[null,null,null,null,"-",null,"-","-","-"]
[null,null,null,null,"-",null,"-","-","-"]
[null,null,null,null,"-",null,"-","-","-"]
[null,null,null,null,"-",null,"-","-","-"]
[null,null,null,null,"-",null,"-","-","-"]
[null,null,null,null,"-",null,"-","-","-"]
[null,null,null,null,"-",null,"-","-","-"]
[null,null,null,null,"-",null,"-","-","-"]
[null,null,null,null,"-",null,"-","-","-"]
[null,null,null,null,"-",null,"-","-","-"]
[null,null,null,null,"-",null,"-","-","-"]
[null,null,null,null,"-",null,"-","-","-"]
[null,null,null,null,"-",null,"-","-","-"]
[null,null,null,null,"-",null,"-","-","-"]

{"sheet":"Riet Geerts","index":90,"n_rows":56,"n_cols":9,"rows_kept":56,"cut":false,"hidden":false,"merged":[[18,7,20,8],[30,3,30,5],[12,1,12,8],[15,1,15,4],[16,1,16,4],[17,1,17,4],[18,1,18,4],[19,1,19,4],[20,1,20,4],[21,1,21,4],[22,1,22,4],[23,1,23,4],[24,1,24,4],[21,7,21,8],[27,1,27,8]]}
[]
[]
[]
[]
[]
[]
[]
[]
[]
[]
[]
[]
[null,"Riet Geerts"]
[]
[]
[null,"Gespeeld",null,null,null,{"$f":"COUNTIF(G32:G57,\"W\")+COUNTIF(G32:G57,\"G\")+COUNTIF(G32:G57,\"V\")","v":10}]
[null,"Gewonnen",null,null,null,{"$f":"COUNTIF(G32:G57,\"W\")","v":3}]
[null,"Gelijk",null,null,null,{"$f":"COUNTIF(G32:G57,\"G\")","v":1}]
[null,"Verloren",null,null,null,{"$f":"COUNTIF(G32:G57,\"V\")","v":6},null,"Wijk van initiële inschrijving\n(met shirtkleur finaledag)"]
[null,"% gewonnen",null,null,null,{"$f":"IF(F16=0,0,F17/F16)","v":0.3}]
[null,"% gelijk",null,null,null,{"$f":"IF(F16=0,0,F18/F16)","v":0.1}]
[null,"% verloren",null,null,null,{"$f":"IF(F16=0,0,F19/F16)","v":0.6},null,"Hondsberg (Rosmalen)"]
[null,"Wedstrijdpunten",null,null,null,{"$f":"SUM(H32:H57)","v":11}]
[null,"Saldopunten",null,null,null,{"$f":"SUM(I32:I57)","v":-26}]
[null,"Saldopunten per wedstrijd",null,null,null,{"$f":"IF(F16=0,0,F24/F16)","v":-2.6}]
[]
[]
[null,"LET OP: alleen wedstrijden die daadwerkelijk gespeeld zijn in de wijk waarvoor jij je hebt ingeschreven tellen mee!"]
[]
[]
[null,"Datum","Locatie","UITSLAGEN",null,null,"W, V of G?","Wedstrijd-punten","Saldo-punten"]
[null,"2021-06-15","Hondsberg (Rosmalen)",9,"-",7,{"$f":"IF(OR($B$13=\"\",wijk_van_inschrijving=\"\"),\"-\",IF(OR(wijk_van_inschrijving<>C32,D32=\"\",F32=\"\"),\"-\",IF(D32>F32,\"W\",IF(D32=F32,\"G\",IF(D32<F32,\"V\",\"-\")))))","v":"W"},{"$f":"IF(OR($B$13=\"\",wijk_van_inschrijving=\"\"),\"-\",IF(OR(wijk_van_inschrijving<>C32,G32=\"-\",G32=\"\"),\"-\",IF(G32=\"W\",3,IF(G32=\"G\",2,IF(G32=\"V\",0,0)))))","v":3},{"$f":"IF(OR($B$13=\"\",wijk_van_inschrijving=\"\"),\"-\",IF(wijk_van_inschrijving<>C32,\"-\",IF(D32>=0,IF(F32=\"\",\"-\",D32-F32))))","v":2}]
[null,"2021-06-15","Hondsberg (Rosmalen)",6,"-",6,"G",2,0]
[null,"2021-06-15","Hondsberg (Rosmalen)",5,"-",13,"V",0,-8]
[null,"2021-06-22","Hondsberg (Rosmalen)",9,"-",2,"W",3,7]
[null,"2021-06-22","Hondsberg (Rosmalen)",7,"-",3,"W",3,4]
[null,"2021-06-30","Hondsberg (Rosmalen)",9,"-",11,"V",0,-2]
[null,"2021-06-30","Hondsberg (Rosmalen)",2,"-",7,"V",0,-5]
[null,"2021-07-07","Hondsberg (Rosmalen)",5,"-",12,"V",0,-7]
[null,"2021-07-07","Hondsberg (Rosmalen)",2,"-",11,"V",0,-9]
[null,"2021-07-07","Hondsberg (Rosmalen)",3,"-",11,"V",0,-8]
[null,null,null,null,"-",null,"-","-","-"]
[null,null,null,null,"-",null,"-","-","-"]
[null,null,null,null,"-",null,"-","-","-"]
[null,null,null,null,"-",null,"-","-","-"]
[null,null,null,null,"-",null,"-","-","-"]
[null,null,null,null,"-",null,"-","-","-"]
[null,null,null,null,"-",null,"-","-","-"]
[null,null,null,null,"-",null,"-","-","-"]
[null,null,null,null,"-",null,"-","-","-"]
[null,null,null,null,"-",null,"-","-","-"]
[null,null,null,null,"-",null,"-","-","-"]
[null,null,null,null,"-",null,"-","-","-"]
[null,null,null,null,"-",null,"-","-","-"]
[null,null,null,null,"-",null,"-","-","-"]
[null,null,null,null,"-",null,"-","-","-"]

{"sheet":"Rikie van der Laar","index":91,"n_rows":56,"n_cols":9,"rows_kept":56,"cut":false,"hidden":false,"merged":[[18,7,20,8],[30,3,30,5],[12,1,12,8],[15,1,15,4],[16,1,16,4],[17,1,17,4],[18,1,18,4],[19,1,19,4],[20,1,20,4],[21,1,21,4],[22,1,22,4],[23,1,23,4],[24,1,24,4],[21,7,21,8],[27,1,27,8]]}
[]
[]
[]
[]
[]
[]
[]
[]
[]
[]
[]
[]
[null,"Rikie van der Laar"]
[]
[]
[null,"Gespeeld",null,null,null,{"$f":"COUNTIF(G32:G57,\"W\")+COUNTIF(G32:G57,\"G\")+COUNTIF(G32:G57,\"V\")","v":3}]
[null,"Gewonnen",null,null,null,{"$f":"COUNTIF(G32:G57,\"W\")","v":1}]
[null,"Gelijk",null,null,null,{"$f":"COUNTIF(G32:G57,\"G\")","v":0}]
[null,"Verloren",null,null,null,{"$f":"COUNTIF(G32:G57,\"V\")","v":2},null,"Wijk van initiële inschrijving\n(met shirtkleur finaledag)"]
[null,"% gewonnen",null,null,null,{"$f":"IF(F16=0,0,F17/F16)","v":0.33333333333333331}]
[null,"% gelijk",null,null,null,{"$f":"IF(F16=0,0,F18/F16)","v":0}]
[null,"% verloren",null,null,null,{"$f":"IF(F16=0,0,F19/F16)","v":0.66666666666666663},null,"De Hambaken"]
[null,"Wedstrijdpunten",null,null,null,{"$f":"SUM(H32:H57)","v":3}]
[null,"Saldopunten",null,null,null,{"$f":"SUM(I32:I57)","v":-5}]
[null,"Saldopunten per wedstrijd",null,null,null,{"$f":"IF(F16=0,0,F24/F16)","v":-1.6666666666666667}]
[]
[]
[null,"LET OP: alleen wedstrijden die daadwerkelijk gespeeld zijn in de wijk waarvoor jij je hebt ingeschreven tellen mee!"]
[]
[]
[null,"Datum","Locatie","UITSLAGEN",null,null,"W, V of G?","Wedstrijd-punten","Saldo-punten"]
[null,"2021-06-16","De Hambaken",4,"-",9,{"$f":"IF(OR($B$13=\"\",wijk_van_inschrijving=\"\"),\"-\",IF(OR(wijk_van_inschrijving<>C32,D32=\"\",F32=\"\"),\"-\",IF(D32>F32,\"W\",IF(D32=F32,\"G\",IF(D32<F32,\"V\",\"-\")))))","v":"V"},{"$f":"IF(OR($B$13=\"\",wijk_van_inschrijving=\"\"),\"-\",IF(OR(wijk_van_inschrijving<>C32,G32=\"-\",G32=\"\"),\"-\",IF(G32=\"W\",3,IF(G32=\"G\",2,IF(G32=\"V\",0,0)))))","v":0},{"$f":"IF(OR($B$13=\"\",wijk_van_inschrijving=\"\"),\"-\",IF(wijk_van_inschrijving<>C32,\"-\",IF(D32>=0,IF(F32=\"\",\"-\",D32-F32))))","v":-5}]
[null,"2021-06-16","De Hambaken",7,"-",6,"W",3,1]
[null,"2021-06-16","De Hambaken",6,"-",7,"V",0,-1]
[null,null,null,null,"-",null,"-","-","-"]
[null,null,null,null,"-",null,"-","-","-"]
[null,null,null,null,"-",null,"-","-","-"]
[null,null,null,null,"-",null,"-","-","-"]
[null,null,null,null,"-",null,"-","-","-"]
[null,null,null,null,"-",null,"-","-","-"]
[null,null,null,null,"-",null,"-","-","-"]
[null,null,null,null,"-",null,"-","-","-"]
[null,null,null,null,"-",null,"-","-","-"]
[null,null,null,null,"-",null,"-","-","-"]
[null,null,null,null,"-",null,"-","-","-"]
[null,null,null,null,"-",null,"-","-","-"]
[null,null,null,null,"-",null,"-","-","-"]
[null,null,null,null,"-",null,"-","-","-"]
[null,null,null,null,"-",null,"-","-","-"]
[null,null,null,null,"-",null,"-","-","-"]
[null,null,null,null,"-",null,"-","-","-"]
[null,null,null,null,"-",null,"-","-","-"]
[null,null,null,null,"-",null,"-","-","-"]
[null,null,null,null,"-",null,"-","-","-"]
[null,null,null,null,"-",null,"-","-","-"]
[null,null,null,null,"-",null,"-","-","-"]

{"sheet":"Rikkie van der Wielen","index":92,"n_rows":56,"n_cols":9,"rows_kept":56,"cut":false,"hidden":false,"merged":[[18,7,20,8],[30,3,30,5],[12,1,12,8],[15,1,15,4],[16,1,16,4],[17,1,17,4],[18,1,18,4],[19,1,19,4],[20,1,20,4],[21,1,21,4],[22,1,22,4],[23,1,23,4],[24,1,24,4],[21,7,21,8],[27,1,27,8]]}
[]
[]
[]
[]
[]
[]
[]
[]
[]
[]
[]
[]
[null,"Rikkie van der Wielen"]
[]
[]
[null,"Gespeeld",null,null,null,{"$f":"COUNTIF(G32:G57,\"W\")+COUNTIF(G32:G57,\"G\")+COUNTIF(G32:G57,\"V\")","v":1}]
[null,"Gewonnen",null,null,null,{"$f":"COUNTIF(G32:G57,\"W\")","v":1}]
[null,"Gelijk",null,null,null,{"$f":"COUNTIF(G32:G57,\"G\")","v":0}]
[null,"Verloren",null,null,null,{"$f":"COUNTIF(G32:G57,\"V\")","v":0},null,"Wijk van initiële inschrijving\n(met shirtkleur finaledag)"]
[null,"% gewonnen",null,null,null,{"$f":"IF(F16=0,0,F17/F16)","v":1}]
[null,"% gelijk",null,null,null,{"$f":"IF(F16=0,0,F18/F16)","v":0}]
[null,"% verloren",null,null,null,{"$f":"IF(F16=0,0,F19/F16)","v":0},null,"De Schutskamp"]
[null,"Wedstrijdpunten",null,null,null,{"$f":"SUM(H32:H57)","v":3}]
[null,"Saldopunten",null,null,null,{"$f":"SUM(I32:I57)","v":4}]
[null,"Saldopunten per wedstrijd",null,null,null,{"$f":"IF(F16=0,0,F24/F16)","v":4}]
[]
[]
[null,"LET OP: alleen wedstrijden die daadwerkelijk gespeeld zijn in de wijk waarvoor jij je hebt ingeschreven tellen mee!"]
[]
[]
[null,"Datum","Locatie","UITSLAGEN",null,null,"W, V of G?","Wedstrijd-punten","Saldo-punten"]
[null,"2021-06-14","De Schutskamp",9,"-",5,{"$f":"IF(OR($B$13=\"\",wijk_van_inschrijving=\"\"),\"-\",IF(OR(wijk_van_inschrijving<>C32,D32=\"\",F32=\"\"),\"-\",IF(D32>F32,\"W\",IF(D32=F32,\"G\",IF(D32<F32,\"V\",\"-\")))))","v":"W"},{"$f":"IF(OR($B$13=\"\",wijk_van_inschrijving=\"\"),\"-\",IF(OR(wijk_van_inschrijving<>C32,G32=\"-\",G32=\"\"),\"-\",IF(G32=\"W\",3,IF(G32=\"G\",2,IF(G32=\"V\",0,0)))))","v":3},{"$f":"IF(OR($B$13=\"\",wijk_van_inschrijving=\"\"),\"-\",IF(wijk_van_inschrijving<>C32,\"-\",IF(D32>=0,IF(F32=\"\",\"-\",D32-F32))))","v":4}]
[null,null,null,null,"-",null,"-","-","-"]
[null,null,null,null,"-",null,"-","-","-"]
[null,null,null,null,"-",null,"-","-","-"]
[null,null,null,null,"-",null,"-","-","-"]
[null,null,null,null,"-",null,"-","-","-"]
[null,null,null,null,"-",null,"-","-","-"]
[null,null,null,null,"-",null,"-","-","-"]
[null,null,null,null,"-",null,"-","-","-"]
[null,null,null,null,"-",null,"-","-","-"]
[null,null,null,null,"-",null,"-","-","-"]
[null,null,null,null,"-",null,"-","-","-"]
[null,null,null,null,"-",null,"-","-","-"]
[null,null,null,null,"-",null,"-","-","-"]
[null,null,null,null,"-",null,"-","-","-"]
[null,null,null,null,"-",null,"-","-","-"]
[null,null,null,null,"-",null,"-","-","-"]
[null,null,null,null,"-",null,"-","-","-"]
[null,null,null,null,"-",null,"-","-","-"]
[null,null,null,null,"-",null,"-","-","-"]
[null,null,null,null,"-",null,"-","-","-"]
[null,null,null,null,"-",null,"-","-","-"]
[null,null,null,null,"-",null,"-","-","-"]
[null,null,null,null,"-",null,"-","-","-"]
[null,null,null,null,"-",null,"-","-","-"]

{"sheet":"Ronald Schoo","index":93,"n_rows":56,"n_cols":9,"rows_kept":56,"cut":false,"hidden":false,"merged":[[18,7,20,8],[30,3,30,5],[12,1,12,8],[15,1,15,4],[16,1,16,4],[17,1,17,4],[18,1,18,4],[19,1,19,4],[20,1,20,4],[21,1,21,4],[22,1,22,4],[23,1,23,4],[24,1,24,4],[21,7,21,8],[27,1,27,8]]}
[]
[]
[]
[]
[]
[]
[]
[]
[]
[]
[]
[]
[null,"Ronald Schoo"]
[]
[]
[null,"Gespeeld",null,null,null,{"$f":"COUNTIF(G32:G57,\"W\")+COUNTIF(G32:G57,\"G\")+COUNTIF(G32:G57,\"V\")","v":12}]
[null,"Gewonnen",null,null,null,{"$f":"COUNTIF(G32:G57,\"W\")","v":6}]
[null,"Gelijk",null,null,null,{"$f":"COUNTIF(G32:G57,\"G\")","v":0}]
[null,"Verloren",null,null,null,{"$f":"COUNTIF(G32:G57,\"V\")","v":6},null,"Wijk van initiële inschrijving\n(met shirtkleur finaledag)"]
[null,"% gewonnen",null,null,null,{"$f":"IF(F16=0,0,F17/F16)","v":0.5}]
[null,"% gelijk",null,null,null,{"$f":"IF(F16=0,0,F18/F16)","v":0}]
[null,"% verloren",null,null,null,{"$f":"IF(F16=0,0,F19/F16)","v":0.5},null,"'s-Hertogenbosch Zuid"]
[null,"Wedstrijdpunten",null,null,null,{"$f":"SUM(H32:H57)","v":18}]
[null,"Saldopunten",null,null,null,{"$f":"SUM(I32:I57)","v":13}]
[null,"Saldopunten per wedstrijd",null,null,null,{"$f":"IF(F16=0,0,F24/F16)","v":1.0833333333333333}]
[]
[]
[null,"LET OP: alleen wedstrijden die daadwerkelijk gespeeld zijn in de wijk waarvoor jij je hebt ingeschreven tellen mee!"]
[]
[]
[null,"Datum","Locatie","UITSLAGEN",null,null,"W, V of G?","Wedstrijd-punten","Saldo-punten"]
[null,"2021-06-18","'s-Hertogenbosch Zuid",4,"-",13,{"$f":"IF(OR($B$13=\"\",wijk_van_inschrijving=\"\"),\"-\",IF(OR(wijk_van_inschrijving<>C32,D32=\"\",F32=\"\"),\"-\",IF(D32>F32,\"W\",IF(D32=F32,\"G\",IF(D32<F32,\"V\",\"-\")))))","v":"V"},{"$f":"IF(OR($B$13=\"\",wijk_van_inschrijving=\"\"),\"-\",IF(OR(wijk_van_inschrijving<>C32,G32=\"-\",G32=\"\"),\"-\",IF(G32=\"W\",3,IF(G32=\"G\",2,IF(G32=\"V\",0,0)))))","v":0},{"$f":"IF(OR($B$13=\"\",wijk_van_inschrijving=\"\"),\"-\",IF(wijk_van_inschrijving<>C32,\"-\",IF(D32>=0,IF(F32=\"\",\"-\",D32-F32))))","v":-9}]
[null,"2021-06-18","'s-Hertogenbosch Zuid",2,"-",6,"V",0,-4]
[null,"2021-06-18","'s-Hertogenbosch Zuid",6,"-",9,"V",0,-3]
[null,"2021-06-25","'s-Hertogenbosch Zuid",8,"-",5,"W",3,3]
[null,"2021-06-25","'s-Hertogenbosch Zuid",3,"-",8,"V",0,-5]
[null,"2021-06-25","'s-Hertogenbosch Zuid",12,"-",5,"W",3,7]
[null,"2021-07-01","'s-Hertogenbosch Zuid",12,"-",7,"W",3,5]
[null,"2021-07-01","'s-Hertogenbosch Zuid",3,"-",11,"V",0,-8]
[null,"2021-07-01","'s-Hertogenbosch Zuid",8,"-",9,"V",0,-1]
[null,"2021-07-08","'s-Hertogenbosch Zuid",13,"-",3,"W",3,10]
[null,"2021-07-08","'s-Hertogenbosch Zuid",10,"-",3,"W",3,7]
[null,"2021-07-08","'s-Hertogenbosch Zuid",12,"-",1,"W",3,11]
[null,null,null,null,"-",null,"-","-","-"]
[null,null,null,null,"-",null,"-","-","-"]
[null,null,null,null,"-",null,"-","-","-"]
[null,null,null,null,"-",null,"-","-","-"]
[null,null,null,null,"-",null,"-","-","-"]
[null,null,null,null,"-",null,"-","-","-"]
[null,null,null,null,"-",null,"-","-","-"]
[null,null,null,null,"-",null,"-","-","-"]
[null,null,null,null,"-",null,"-","-","-"]
[null,null,null,null,"-",null,"-","-","-"]
[null,null,null,null,"-",null,"-","-","-"]
[null,null,null,null,"-",null,"-","-","-"]
[null,null,null,null,"-",null,"-","-","-"]

{"sheet":"Roy van de Brink","index":94,"n_rows":56,"n_cols":9,"rows_kept":56,"cut":false,"hidden":false,"merged":[[18,7,20,8],[30,3,30,5],[12,1,12,8],[15,1,15,4],[16,1,16,4],[17,1,17,4],[18,1,18,4],[19,1,19,4],[20,1,20,4],[21,1,21,4],[22,1,22,4],[23,1,23,4],[24,1,24,4],[21,7,21,8],[27,1,27,8]]}
[]
[]
[]
[]
[]
[]
[]
[]
[]
[]
[]
[]
[null,"Roy van de Brink"]
[]
[]
[null,"Gespeeld",null,null,null,{"$f":"COUNTIF(G32:G57,\"W\")+COUNTIF(G32:G57,\"G\")+COUNTIF(G32:G57,\"V\")","v":12}]
[null,"Gewonnen",null,null,null,{"$f":"COUNTIF(G32:G57,\"W\")","v":6}]
[null,"Gelijk",null,null,null,{"$f":"COUNTIF(G32:G57,\"G\")","v":1}]
[null,"Verloren",null,null,null,{"$f":"COUNTIF(G32:G57,\"V\")","v":5},null,"Wijk van initiële inschrijving\n(met shirtkleur finaledag)"]
[null,"% gewonnen",null,null,null,{"$f":"IF(F16=0,0,F17/F16)","v":0.5}]
[null,"% gelijk",null,null,null,{"$f":"IF(F16=0,0,F18/F16)","v":8.3333333333333329E-2}]
[null,"% verloren",null,null,null,{"$f":"IF(F16=0,0,F19/F16)","v":0.41666666666666669},null,"'s-Hertogenbosch Zuid"]
[null,"Wedstrijdpunten",null,null,null,{"$f":"SUM(H32:H57)","v":20}]
[null,"Saldopunten",null,null,null,{"$f":"SUM(I32:I57)","v":0}]
[null,"Saldopunten per wedstrijd",null,null,null,{"$f":"IF(F16=0,0,F24/F16)","v":0}]
[]
[]
[null,"LET OP: alleen wedstrijden die daadwerkelijk gespeeld zijn in de wijk waarvoor jij je hebt ingeschreven tellen mee!"]
[]
[]
[null,"Datum","Locatie","UITSLAGEN",null,null,"W, V of G?","Wedstrijd-punten","Saldo-punten"]
[null,"2021-06-18","'s-Hertogenbosch Zuid",13,"-",1,{"$f":"IF(OR($B$13=\"\",wijk_van_inschrijving=\"\"),\"-\",IF(OR(wijk_van_inschrijving<>C32,D32=\"\",F32=\"\"),\"-\",IF(D32>F32,\"W\",IF(D32=F32,\"G\",IF(D32<F32,\"V\",\"-\")))))","v":"W"},{"$f":"IF(OR($B$13=\"\",wijk_van_inschrijving=\"\"),\"-\",IF(OR(wijk_van_inschrijving<>C32,G32=\"-\",G32=\"\"),\"-\",IF(G32=\"W\",3,IF(G32=\"G\",2,IF(G32=\"V\",0,0)))))","v":3},{"$f":"IF(OR($B$13=\"\",wijk_van_inschrijving=\"\"),\"-\",IF(wijk_van_inschrijving<>C32,\"-\",IF(D32>=0,IF(F32=\"\",\"-\",D32-F32))))","v":12}]
[null,"2021-06-18","'s-Hertogenbosch Zuid",6,"-",2,"W",3,4]
[null,"2021-06-18","'s-Hertogenbosch Zuid",2,"-",13,"V",0,-11]
[null,"2021-06-25","'s-Hertogenbosch Zuid",5,"-",8,"V",0,-3]
[null,"2021-06-25","'s-Hertogenbosch Zuid",0,"-",13,"V",0,-13]
[null,"2021-06-25","'s-Hertogenbosch Zuid",3,"-",13,"V",0,-10]
[null,"2021-07-01","'s-Hertogenbosch Zuid",7,"-",7,"G",2,0]
[null,"2021-07-01","'s-Hertogenbosch Zuid",13,"-",5,"W",3,8]
[null,"2021-07-01","'s-Hertogenbosch Zuid",12,"-",8,"W",3,4]
[null,"2021-07-08","'s-Hertogenbosch Zuid",10,"-",2,"W",3,8]
[null,"2021-07-08","'s-Hertogenbosch Zuid",13,"-",1,"W",3,12]
[null,"2021-07-08","'s-Hertogenbosch Zuid",1,"-",12,"V",0,-11]
[null,null,null,null,"-",null,"-","-","-"]
[null,null,null,null,"-",null,"-","-","-"]
[null,null,null,null,"-",null,"-","-","-"]
[null,null,null,null,"-",null,"-","-","-"]
[null,null,null,null,"-",null,"-","-","-"]
[null,null,null,null,"-",null,"-","-","-"]
[null,null,null,null,"-",null,"-","-","-"]
[null,null,null,null,"-",null,"-","-","-"]
[null,null,null,null,"-",null,"-","-","-"]
[null,null,null,null,"-",null,"-","-","-"]
[null,null,null,null,"-",null,"-","-","-"]
[null,null,null,null,"-",null,"-","-","-"]
[null,null,null,null,"-",null,"-","-","-"]

{"sheet":"Ruud van Hintum","index":95,"n_rows":56,"n_cols":9,"rows_kept":56,"cut":false,"hidden":false,"merged":[[30,3,30,5],[21,1,21,4],[21,7,21,8],[22,1,22,4],[23,1,23,4],[24,1,24,4],[27,1,27,8],[12,1,12,8],[15,1,15,4],[16,1,16,4],[17,1,17,4],[18,1,18,4],[18,7,20,8],[19,1,19,4],[20,1,20,4]]}
[]
[]
[]
[]
[]
[]
[]
[]
[]
[]
[]
[]
[null,"Ruud van Hintum"]
[]
[]
[null,"Gespeeld",null,null,null,{"$f":"COUNTIF(G32:G57,\"W\")+COUNTIF(G32:G57,\"G\")+COUNTIF(G32:G57,\"V\")","v":3}]
[null,"Gewonnen",null,null,null,{"$f":"COUNTIF(G32:G57,\"W\")","v":3}]
[null,"Gelijk",null,null,null,{"$f":"COUNTIF(G32:G57,\"G\")","v":0}]
[null,"Verloren",null,null,null,{"$f":"COUNTIF(G32:G57,\"V\")","v":0},null,"Wijk van initiële inschrijving\n(met shirtkleur finaledag)"]
[null,"% gewonnen",null,null,null,{"$f":"IF(F16=0,0,F17/F16)","v":1}]
[null,"% gelijk",null,null,null,{"$f":"IF(F16=0,0,F18/F16)","v":0}]
[null,"% verloren",null,null,null,{"$f":"IF(F16=0,0,F19/F16)","v":0},null,"De Hambaken"]
[null,"Wedstrijdpunten",null,null,null,{"$f":"SUM(H32:H57)","v":9}]
[null,"Saldopunten",null,null,null,{"$f":"SUM(I32:I57)","v":13}]
[null,"Saldopunten per wedstrijd",null,null,null,{"$f":"IF(F16=0,0,F24/F16)","v":4.333333333333333}]
[]
[]
[null,"LET OP: alleen wedstrijden die daadwerkelijk gespeeld zijn in de wijk waarvoor jij je hebt ingeschreven tellen mee!"]
[]
[]
[null,"Datum","Locatie","UITSLAGEN",null,null,"W, V of G?","Wedstrijd-punten","Saldo-punten"]
[null,"2021-07-06","De Hambaken",13,"-",11,{"$f":"IF(OR($B$13=\"\",wijk_van_inschrijving=\"\"),\"-\",IF(OR(wijk_van_inschrijving<>C32,D32=\"\",F32=\"\"),\"-\",IF(D32>F32,\"W\",IF(D32=F32,\"G\",IF(D32<F32,\"V\",\"-\")))))","v":"W"},{"$f":"IF(OR($B$13=\"\",wijk_van_inschrijving=\"\"),\"-\",IF(OR(wijk_van_inschrijving<>C32,G32=\"-\",G32=\"\"),\"-\",IF(G32=\"W\",3,IF(G32=\"G\",2,IF(G32=\"V\",0,0)))))","v":3},{"$f":"IF(OR($B$13=\"\",wijk_van_inschrijving=\"\"),\"-\",IF(wijk_van_inschrijving<>C32,\"-\",IF(D32>=0,IF(F32=\"\",\"-\",D32-F32))))","v":2}]
[null,"2021-07-06","De Hambaken",13,"-",5,"W",3,8]
[null,"2021-07-06","De Hambaken",9,"-",6,"W",3,3]
[null,null,null,null,"-",null,"-","-","-"]
[null,null,null,null,"-",null,"-","-","-"]
[null,null,null,null,"-",null,"-","-","-"]
[null,null,null,null,"-",null,"-","-","-"]
[null,null,null,null,"-",null,"-","-","-"]
[null,null,null,null,"-",null,"-","-","-"]
[null,null,null,null,"-",null,"-","-","-"]
[null,null,null,null,"-",null,"-","-","-"]
[null,null,null,null,"-",null,"-","-","-"]
[null,null,null,null,"-",null,"-","-","-"]
[null,null,null,null,"-",null,"-","-","-"]
[null,null,null,null,"-",null,"-","-","-"]
[null,null,null,null,"-",null,"-","-","-"]
[null,null,null,null,"-",null,"-","-","-"]
[null,null,null,null,"-",null,"-","-","-"]
[null,null,null,null,"-",null,"-","-","-"]
[null,null,null,null,"-",null,"-","-","-"]
[null,null,null,null,"-",null,"-","-","-"]
[null,null,null,null,"-",null,"-","-","-"]
[null,null,null,null,"-",null,"-","-","-"]
[null,null,null,null,"-",null,"-","-","-"]
[null,null,null,null,"-",null,"-","-","-"]

{"sheet":"Sjan Ondersteijn","index":96,"n_rows":56,"n_cols":9,"rows_kept":56,"cut":false,"hidden":false,"merged":[[18,7,20,8],[30,3,30,5],[12,1,12,8],[15,1,15,4],[16,1,16,4],[17,1,17,4],[18,1,18,4],[19,1,19,4],[20,1,20,4],[21,1,21,4],[22,1,22,4],[23,1,23,4],[24,1,24,4],[21,7,21,8],[27,1,27,8]]}
[]
[]
[]
[]
[]
[]
[]
[]
[]
[]
[]
[]
[null,"Sjan Ondersteijn"]
[]
[]
[null,"Gespeeld",null,null,null,{"$f":"COUNTIF(G32:G57,\"W\")+COUNTIF(G32:G57,\"G\")+COUNTIF(G32:G57,\"V\")","v":12}]
[null,"Gewonnen",null,null,null,{"$f":"COUNTIF(G32:G57,\"W\")","v":7}]
[null,"Gelijk",null,null,null,{"$f":"COUNTIF(G32:G57,\"G\")","v":1}]
[null,"Verloren",null,null,null,{"$f":"COUNTIF(G32:G57,\"V\")","v":4},null,"Wijk van initiële inschrijving\n(met shirtkleur finaledag)"]
[null,"% gewonnen",null,null,null,{"$f":"IF(F16=0,0,F17/F16)","v":0.58333333333333337}]
[null,"% gelijk",null,null,null,{"$f":"IF(F16=0,0,F18/F16)","v":8.3333333333333329E-2}]
[null,"% verloren",null,null,null,{"$f":"IF(F16=0,0,F19/F16)","v":0.33333333333333331},null,"'s-Hertogenbosch Zuid"]
[null,"Wedstrijdpunten",null,null,null,{"$f":"SUM(H32:H57)","v":23}]
[null,"Saldopunten",null,null,null,{"$f":"SUM(I32:I57)","v":26}]
[null,"Saldopunten per wedstrijd",null,null,null,{"$f":"IF(F16=0,0,F24/F16)","v":2.1666666666666665}]
[]
[]
[null,"LET OP: alleen wedstrijden die daadwerkelijk gespeeld zijn in de wijk waarvoor jij je hebt ingeschreven tellen mee!"]
[]
[]
[null,"Datum","Locatie","UITSLAGEN",null,null,"W, V of G?","Wedstrijd-punten","Saldo-punten"]
[null,"2021-06-18","'s-Hertogenbosch Zuid",13,"-",2,{"$f":"IF(OR($B$13=\"\",wijk_van_inschrijving=\"\"),\"-\",IF(OR(wijk_van_inschrijving<>C32,D32=\"\",F32=\"\"),\"-\",IF(D32>F32,\"W\",IF(D32=F32,\"G\",IF(D32<F32,\"V\",\"-\")))))","v":"W"},{"$f":"IF(OR($B$13=\"\",wijk_van_inschrijving=\"\"),\"-\",IF(OR(wijk_van_inschrijving<>C32,G32=\"-\",G32=\"\"),\"-\",IF(G32=\"W\",3,IF(G32=\"G\",2,IF(G32=\"V\",0,0)))))","v":3},{"$f":"IF(OR($B$13=\"\",wijk_van_inschrijving=\"\"),\"-\",IF(wijk_van_inschrijving<>C32,\"-\",IF(D32>=0,IF(F32=\"\",\"-\",D32-F32))))","v":11}]
[null,"2021-06-18","'s-Hertogenbosch Zuid",7,"-",5,"W",3,2]
[null,"2021-06-18","'s-Hertogenbosch Zuid",9,"-",6,"W",3,3]
[null,"2021-06-25","'s-Hertogenbosch Zuid",9,"-",9,"G",2,0]
[null,"2021-06-25","'s-Hertogenbosch Zuid",12,"-",5,"W",3,7]
[null,"2021-06-25","'s-Hertogenbosch Zuid",13,"-",3,"W",3,10]
[null,"2021-07-01","'s-Hertogenbosch Zuid",5,"-",13,"V",0,-8]
[null,"2021-07-01","'s-Hertogenbosch Zuid",13,"-",4,"W",3,9]
[null,"2021-07-01","'s-Hertogenbosch Zuid",8,"-",12,"V",0,-4]
[null,"2021-07-08","'s-Hertogenbosch Zuid",3,"-",11,"V",0,-8]
[null,"2021-07-08","'s-Hertogenbosch Zuid",3,"-",10,"V",0,-7]
[null,"2021-07-08","'s-Hertogenbosch Zuid",12,"-",1,"W",3,11]
[null,null,null,null,"-",null,"-","-","-"]
[null,null,null,null,"-",null,"-","-","-"]
[null,null,null,null,"-",null,"-","-","-"]
[null,null,null,null,"-",null,"-","-","-"]
[null,null,null,null,"-",null,"-","-","-"]
[null,null,null,null,"-",null,"-","-","-"]
[null,null,null,null,"-",null,"-","-","-"]
[null,null,null,null,"-",null,"-","-","-"]
[null,null,null,null,"-",null,"-","-","-"]
[null,null,null,null,"-",null,"-","-","-"]
[null,null,null,null,"-",null,"-","-","-"]
[null,null,null,null,"-",null,"-","-","-"]
[null,null,null,null,"-",null,"-","-","-"]

{"sheet":"Sylvester …","index":97,"n_rows":56,"n_cols":9,"rows_kept":56,"cut":false,"hidden":false,"merged":[[18,7,20,8],[30,3,30,5],[12,1,12,8],[15,1,15,4],[16,1,16,4],[17,1,17,4],[18,1,18,4],[19,1,19,4],[20,1,20,4],[21,1,21,4],[22,1,22,4],[23,1,23,4],[24,1,24,4],[21,7,21,8],[27,1,27,8]]}
[]
[]
[]
[]
[]
[]
[]
[]
[]
[]
[]
[]
[null,"Sylvester …"]
[]
[]
[null,"Gespeeld",null,null,null,{"$f":"COUNTIF(G32:G57,\"W\")+COUNTIF(G32:G57,\"G\")+COUNTIF(G32:G57,\"V\")","v":3}]
[null,"Gewonnen",null,null,null,{"$f":"COUNTIF(G32:G57,\"W\")","v":2}]
[null,"Gelijk",null,null,null,{"$f":"COUNTIF(G32:G57,\"G\")","v":0}]
[null,"Verloren",null,null,null,{"$f":"COUNTIF(G32:G57,\"V\")","v":1},null,"Wijk van initiële inschrijving\n(met shirtkleur finaledag)"]
[null,"% gewonnen",null,null,null,{"$f":"IF(F16=0,0,F17/F16)","v":0.66666666666666663}]
[null,"% gelijk",null,null,null,{"$f":"IF(F16=0,0,F18/F16)","v":0}]
[null,"% verloren",null,null,null,{"$f":"IF(F16=0,0,F19/F16)","v":0.33333333333333331},null,"De Schutskamp"]
[null,"Wedstrijdpunten",null,null,null,{"$f":"SUM(H32:H57)","v":6}]
[null,"Saldopunten",null,null,null,{"$f":"SUM(I32:I57)","v":-6}]
[null,"Saldopunten per wedstrijd",null,null,null,{"$f":"IF(F16=0,0,F24/F16)","v":-2}]
[]
[]
[null,"LET OP: alleen wedstrijden die daadwerkelijk gespeeld zijn in de wijk waarvoor jij je hebt ingeschreven tellen mee!"]
[]
[]
[null,"Datum","Locatie","UITSLAGEN",null,null,"W, V of G?","Wedstrijd-punten","Saldo-punten"]
[null,"2021-06-14","De Schutskamp",7,"-",4,{"$f":"IF(OR($B$13=\"\",wijk_van_inschrijving=\"\"),\"-\",IF(OR(wijk_van_inschrijving<>C32,D32=\"\",F32=\"\"),\"-\",IF(D32>F32,\"W\",IF(D32=F32,\"G\",IF(D32<F32,\"V\",\"-\")))))","v":"W"},{"$f":"IF(OR($B$13=\"\",wijk_van_inschrijving=\"\"),\"-\",IF(OR(wijk_van_inschrijving<>C32,G32=\"-\",G32=\"\"),\"-\",IF(G32=\"W\",3,IF(G32=\"G\",2,IF(G32=\"V\",0,0)))))","v":3},{"$f":"IF(OR($B$13=\"\",wijk_van_inschrijving=\"\"),\"-\",IF(wijk_van_inschrijving<>C32,\"-\",IF(D32>=0,IF(F32=\"\",\"-\",D32-F32))))","v":3}]
[null,"2021-06-14","De Schutskamp",0,"-",13,"V",0,-13]
[null,"2021-06-14","De Schutskamp",9,"-",5,"W",3,4]
[null,null,null,null,"-",null,"-","-","-"]
[null,null,null,null,"-",null,"-","-","-"]
[null,null,null,null,"-",null,"-","-","-"]
[null,null,null,null,"-",null,"-","-","-"]
[null,null,null,null,"-",null,"-","-","-"]
[null,null,null,null,"-",null,"-","-","-"]
[null,null,null,null,"-",null,"-","-","-"]
[null,null,null,null,"-",null,"-","-","-"]
[null,null,null,null,"-",null,"-","-","-"]
[null,null,null,null,"-",null,"-","-","-"]
[null,null,null,null,"-",null,"-","-","-"]
[null,null,null,null,"-",null,"-","-","-"]
[null,null,null,null,"-",null,"-","-","-"]
[null,null,null,null,"-",null,"-","-","-"]
[null,null,null,null,"-",null,"-","-","-"]
[null,null,null,null,"-",null,"-","-","-"]
[null,null,null,null,"-",null,"-","-","-"]
[null,null,null,null,"-",null,"-","-","-"]
[null,null,null,null,"-",null,"-","-","-"]
[null,null,null,null,"-",null,"-","-","-"]
[null,null,null,null,"-",null,"-","-","-"]
[null,null,null,null,"-",null,"-","-","-"]

{"sheet":"Tara van der Heijden","index":98,"n_rows":56,"n_cols":9,"rows_kept":56,"cut":false,"hidden":false,"merged":[[27,1,27,8],[30,3,30,5],[20,1,20,4],[21,7,21,8],[21,1,21,4],[22,1,22,4],[23,1,23,4],[24,1,24,4],[18,7,20,8],[19,1,19,4],[12,1,12,8],[15,1,15,4],[16,1,16,4],[17,1,17,4],[18,1,18,4]]}
[]
[]
[]
[]
[]
[]
[]
[]
[]
[]
[]
[]
[null,"Tara van der Heijden"]
[]
[]
[null,"Gespeeld",null,null,null,{"$f":"COUNTIF(G32:G57,\"W\")+COUNTIF(G32:G57,\"G\")+COUNTIF(G32:G57,\"V\")","v":3}]
[null,"Gewonnen",null,null,null,{"$f":"COUNTIF(G32:G57,\"W\")","v":1}]
[null,"Gelijk",null,null,null,{"$f":"COUNTIF(G32:G57,\"G\")","v":0}]
[null,"Verloren",null,null,null,{"$f":"COUNTIF(G32:G57,\"V\")","v":2},null,"Wijk van initiële inschrijving\n(met shirtkleur finaledag)"]
[null,"% gewonnen",null,null,null,{"$f":"IF(F16=0,0,F17/F16)","v":0.33333333333333331}]
[null,"% gelijk",null,null,null,{"$f":"IF(F16=0,0,F18/F16)","v":0}]
[null,"% verloren",null,null,null,{"$f":"IF(F16=0,0,F19/F16)","v":0.66666666666666663},null,"De Schutskamp"]
[null,"Wedstrijdpunten",null,null,null,{"$f":"SUM(H32:H57)","v":3}]
[null,"Saldopunten",null,null,null,{"$f":"SUM(I32:I57)","v":-9}]
[null,"Saldopunten per wedstrijd",null,null,null,{"$f":"IF(F16=0,0,F24/F16)","v":-3}]
[]
[]
[null,"LET OP: alleen wedstrijden die daadwerkelijk gespeeld zijn in de wijk waarvoor jij je hebt ingeschreven tellen mee!"]
[]
[]
[null,"Datum","Locatie","UITSLAGEN",null,null,"W, V of G?","Wedstrijd-punten","Saldo-punten"]
[null,"2021-06-24","De Schutskamp",11,"-",7,{"$f":"IF(OR($B$13=\"\",wijk_van_inschrijving=\"\"),\"-\",IF(OR(wijk_van_inschrijving<>C32,D32=\"\",F32=\"\"),\"-\",IF(D32>F32,\"W\",IF(D32=F32,\"G\",IF(D32<F32,\"V\",\"-\")))))","v":"W"},{"$f":"IF(OR($B$13=\"\",wijk_van_inschrijving=\"\"),\"-\",IF(OR(wijk_van_inschrijving<>C32,G32=\"-\",G32=\"\"),\"-\",IF(G32=\"W\",3,IF(G32=\"G\",2,IF(G32=\"V\",0,0)))))","v":3},{"$f":"IF(OR($B$13=\"\",wijk_van_inschrijving=\"\"),\"-\",IF(wijk_van_inschrijving<>C32,\"-\",IF(D32>=0,IF(F32=\"\",\"-\",D32-F32))))","v":4}]
[null,"2021-06-24","De Schutskamp",1,"-",13,"V",0,-12]
[null,"2021-06-24","De Schutskamp",12,"-",13,"V",0,-1]
[null,null,null,null,"-",null,"-","-","-"]
[null,null,null,null,"-",null,"-","-","-"]
[null,null,null,null,"-",null,"-","-","-"]
[null,null,null,null,"-",null,"-","-","-"]
[null,null,null,null,"-",null,"-","-","-"]
[null,null,null,null,"-",null,"-","-","-"]
[null,null,null,null,"-",null,"-","-","-"]
[null,null,null,null,"-",null,"-","-","-"]
[null,null,null,null,"-",null,"-","-","-"]
[null,null,null,null,"-",null,"-","-","-"]
[null,null,null,null,"-",null,"-","-","-"]
[null,null,null,null,"-",null,"-","-","-"]
[null,null,null,null,"-",null,"-","-","-"]
[null,null,null,null,"-",null,"-","-","-"]
[null,null,null,null,"-",null,"-","-","-"]
[null,null,null,null,"-",null,"-","-","-"]
[null,null,null,null,"-",null,"-","-","-"]
[null,null,null,null,"-",null,"-","-","-"]
[null,null,null,null,"-",null,"-","-","-"]
[null,null,null,null,"-",null,"-","-","-"]
[null,null,null,null,"-",null,"-","-","-"]
[null,null,null,null,"-",null,"-","-","-"]

{"sheet":"Theo Craane","index":99,"n_rows":56,"n_cols":9,"rows_kept":56,"cut":false,"hidden":false,"merged":[[18,7,20,8],[30,3,30,5],[12,1,12,8],[15,1,15,4],[16,1,16,4],[17,1,17,4],[18,1,18,4],[19,1,19,4],[20,1,20,4],[21,1,21,4],[22,1,22,4],[23,1,23,4],[24,1,24,4],[21,7,21,8],[27,1,27,8]]}
[]
[]
[]
[]
[]
[]
[]
[]
[]
[]
[]
[]
[null,"Theo Craane"]
[]
[]
[null,"Gespeeld",null,null,null,{"$f":"COUNTIF(G32:G57,\"W\")+COUNTIF(G32:G57,\"G\")+COUNTIF(G32:G57,\"V\")","v":10}]
[null,"Gewonnen",null,null,null,{"$f":"COUNTIF(G32:G57,\"W\")","v":3}]
[null,"Gelijk",null,null,null,{"$f":"COUNTIF(G32:G57,\"G\")","v":1}]
[null,"Verloren",null,null,null,{"$f":"COUNTIF(G32:G57,\"V\")","v":6},null,"Wijk van initiële inschrijving\n(met shirtkleur finaledag)"]
[null,"% gewonnen",null,null,null,{"$f":"IF(F16=0,0,F17/F16)","v":0.3}]
[null,"% gelijk",null,null,null,{"$f":"IF(F16=0,0,F18/F16)","v":0.1}]
[null,"% verloren",null,null,null,{"$f":"IF(F16=0,0,F19/F16)","v":0.6},null,"Hondsberg (Rosmalen)"]
[null,"Wedstrijdpunten",null,null,null,{"$f":"SUM(H32:H57)","v":11}]
[null,"Saldopunten",null,null,null,{"$f":"SUM(I32:I57)","v":-1}]
[null,"Saldopunten per wedstrijd",null,null,null,{"$f":"IF(F16=0,0,F24/F16)","v":-0.1}]
[]
[]
[null,"LET OP: alleen wedstrijden die daadwerkelijk gespeeld zijn in de wijk waarvoor jij je hebt ingeschreven tellen mee!"]
[]
[]
[null,"Datum","Locatie","UITSLAGEN",null,null,"W, V of G?","Wedstrijd-punten","Saldo-punten"]
[null,"2021-06-15","Hondsberg (Rosmalen)",5,"-",8,{"$f":"IF(OR($B$13=\"\",wijk_van_inschrijving=\"\"),\"-\",IF(OR(wijk_van_inschrijving<>C32,D32=\"\",F32=\"\"),\"-\",IF(D32>F32,\"W\",IF(D32=F32,\"G\",IF(D32<F32,\"V\",\"-\")))))","v":"V"},{"$f":"IF(OR($B$13=\"\",wijk_van_inschrijving=\"\"),\"-\",IF(OR(wijk_van_inschrijving<>C32,G32=\"-\",G32=\"\"),\"-\",IF(G32=\"W\",3,IF(G32=\"G\",2,IF(G32=\"V\",0,0)))))","v":0},{"$f":"IF(OR($B$13=\"\",wijk_van_inschrijving=\"\"),\"-\",IF(wijk_van_inschrijving<>C32,\"-\",IF(D32>=0,IF(F32=\"\",\"-\",D32-F32))))","v":-3}]
[null,"2021-06-15","Hondsberg (Rosmalen)",6,"-",8,"V",0,-2]
[null,"2021-06-15","Hondsberg (Rosmalen)",8,"-",8,"G",2,0]
[null,"2021-06-22","Hondsberg (Rosmalen)",4,"-",10,"V",0,-6]
[null,"2021-06-22","Hondsberg (Rosmalen)",6,"-",13,"V",0,-7]
[null,"2021-06-30","Hondsberg (Rosmalen)",13,"-",2,"W",3,11]
[null,"2021-06-30","Hondsberg (Rosmalen)",7,"-",2,"W",3,5]
[null,"2021-07-07","Hondsberg (Rosmalen)",5,"-",12,"V",0,-7]
[null,"2021-07-07","Hondsberg (Rosmalen)",11,"-",2,"W",3,9]
[null,"2021-07-07","Hondsberg (Rosmalen)",5,"-",6,"V",0,-1]
[null,null,null,null,"-",null,"-","-","-"]
[null,null,null,null,"-",null,"-","-","-"]
[null,null,null,null,"-",null,"-","-","-"]
[null,null,null,null,"-",null,"-","-","-"]
[null,null,null,null,"-",null,"-","-","-"]
[null,null,null,null,"-",null,"-","-","-"]
[null,null,null,null,"-",null,"-","-","-"]
[null,null,null,null,"-",null,"-","-","-"]
[null,null,null,null,"-",null,"-","-","-"]
[null,null,null,null,"-",null,"-","-","-"]
[null,null,null,null,"-",null,"-","-","-"]
[null,null,null,null,"-",null,"-","-","-"]
[null,null,null,null,"-",null,"-","-","-"]
[null,null,null,null,"-",null,"-","-","-"]
[null,null,null,null,"-",null,"-","-","-"]

{"sheet":"Tijs Verbruggen","index":100,"n_rows":56,"n_cols":9,"rows_kept":56,"cut":false,"hidden":false,"merged":[[18,7,20,8],[30,3,30,5],[12,1,12,8],[15,1,15,4],[16,1,16,4],[17,1,17,4],[18,1,18,4],[19,1,19,4],[20,1,20,4],[21,1,21,4],[22,1,22,4],[23,1,23,4],[24,1,24,4],[21,7,21,8],[27,1,27,8]]}
[]
[]
[]
[]
[]
[]
[]
[]
[]
[]
[]
[]
[null,"Tijs Verbruggen"]
[]
[]
[null,"Gespeeld",null,null,null,{"$f":"COUNTIF(G32:G57,\"W\")+COUNTIF(G32:G57,\"G\")+COUNTIF(G32:G57,\"V\")","v":6}]
[null,"Gewonnen",null,null,null,{"$f":"COUNTIF(G32:G57,\"W\")","v":1}]
[null,"Gelijk",null,null,null,{"$f":"COUNTIF(G32:G57,\"G\")","v":0}]
[null,"Verloren",null,null,null,{"$f":"COUNTIF(G32:G57,\"V\")","v":5},null,"Wijk van initiële inschrijving\n(met shirtkleur finaledag)"]
[null,"% gewonnen",null,null,null,{"$f":"IF(F16=0,0,F17/F16)","v":0.16666666666666666}]
[null,"% gelijk",null,null,null,{"$f":"IF(F16=0,0,F18/F16)","v":0}]
[null,"% verloren",null,null,null,{"$f":"IF(F16=0,0,F19/F16)","v":0.83333333333333337},null,"'s-Hertogenbosch Zuid"]
[null,"Wedstrijdpunten",null,null,null,{"$f":"SUM(H32:H57)","v":3}]
[null,"Saldopunten",null,null,null,{"$f":"SUM(I32:I57)","v":-44}]
[null,"Saldopunten per wedstrijd",null,null,null,{"$f":"IF(F16=0,0,F24/F16)","v":-7.333333333333333}]
[]
[]
[null,"LET OP: alleen wedstrijden die daadwerkelijk gespeeld zijn in de wijk waarvoor jij je hebt ingeschreven tellen mee!"]
[]
[]
[null,"Datum","Locatie","UITSLAGEN",null,null,"W, V of G?","Wedstrijd-punten","Saldo-punten"]
[null,"2021-06-18","'s-Hertogenbosch Zuid",2,"-",13,{"$f":"IF(OR($B$13=\"\",wijk_van_inschrijving=\"\"),\"-\",IF(OR(wijk_van_inschrijving<>C32,D32=\"\",F32=\"\"),\"-\",IF(D32>F32,\"W\",IF(D32=F32,\"G\",IF(D32<F32,\"V\",\"-\")))))","v":"V"},{"$f":"IF(OR($B$13=\"\",wijk_van_inschrijving=\"\"),\"-\",IF(OR(wijk_van_inschrijving<>C32,G32=\"-\",G32=\"\"),\"-\",IF(G32=\"W\",3,IF(G32=\"G\",2,IF(G32=\"V\",0,0)))))","v":0},{"$f":"IF(OR($B$13=\"\",wijk_van_inschrijving=\"\"),\"-\",IF(wijk_van_inschrijving<>C32,\"-\",IF(D32>=0,IF(F32=\"\",\"-\",D32-F32))))","v":-11}]
[null,"2021-06-18","'s-Hertogenbosch Zuid",1,"-",12,"V",0,-11]
[null,"2021-06-18","'s-Hertogenbosch Zuid",13,"-",1,"W",3,12]
[null,"2021-06-29","De Hambaken",3,"-",13,"-","-","-"]
[null,"2021-06-29","De Hambaken",13,"-",2,"-","-","-"]
[null,"2021-06-29","De Hambaken",13,"-",4,"-","-","-"]
[null,"2021-06-30","Hondsberg (Rosmalen)",11,"-",9,"-","-","-"]
[null,"2021-06-30","Hondsberg (Rosmalen)",0,"-",12,"-","-","-"]
[null,"2021-06-30","Hondsberg (Rosmalen)",13,"-",5,"-","-","-"]
[null,"2021-07-01","'s-Hertogenbosch Zuid",0,"-",13,"V",0,-13]
[null,"2021-07-01","'s-Hertogenbosch Zuid",5,"-",13,"V",0,-8]
[null,"2021-07-01","'s-Hertogenbosch Zuid",0,"-",13,"V",0,-13]
[null,"2021-07-05","De Schutskamp",7,"-",5,"-","-","-"]
[null,"2021-07-05","De Schutskamp",13,"-",2,"-","-","-"]
[null,"2021-07-05","De Schutskamp",13,"-",3,"-","-","-"]
[null,null,null,null,"-",null,"-","-","-"]
[null,null,null,null,"-",null,"-","-","-"]
[null,null,null,null,"-",null,"-","-","-"]
[null,null,null,null,"-",null,"-","-","-"]
[null,null,null,null,"-",null,"-","-","-"]
[null,null,null,null,"-",null,"-","-","-"]
[null,null,null,null,"-",null,"-","-","-"]
[null,null,null,null,"-",null,"-","-","-"]
[null,null,null,null,"-",null,"-","-","-"]
[null,null,null,null,"-",null,"-","-","-"]

{"sheet":"Tiny Heijmans","index":101,"n_rows":56,"n_cols":9,"rows_kept":56,"cut":false,"hidden":false,"merged":[[18,7,20,8],[30,3,30,5],[12,1,12,8],[15,1,15,4],[16,1,16,4],[17,1,17,4],[18,1,18,4],[19,1,19,4],[20,1,20,4],[21,1,21,4],[22,1,22,4],[23,1,23,4],[24,1,24,4],[21,7,21,8],[27,1,27,8]]}
[]
[]
[]
[]
[]
[]
[]
[]
[]
[]
[]
[]
[null,"Tiny Heijmans"]
[]
[]
[null,"Gespeeld",null,null,null,{"$f":"COUNTIF(G32:G57,\"W\")+COUNTIF(G32:G57,\"G\")+COUNTIF(G32:G57,\"V\")","v":5}]
[null,"Gewonnen",null,null,null,{"$f":"COUNTIF(G32:G57,\"W\")","v":3}]
[null,"Gelijk",null,null,null,{"$f":"COUNTIF(G32:G57,\"G\")","v":1}]
[null,"Verloren",null,null,null,{"$f":"COUNTIF(G32:G57,\"V\")","v":1},null,"Wijk van initiële inschrijving\n(met shirtkleur finaledag)"]
[null,"% gewonnen",null,null,null,{"$f":"IF(F16=0,0,F17/F16)","v":0.6}]
[null,"% gelijk",null,null,null,{"$f":"IF(F16=0,0,F18/F16)","v":0.2}]
[null,"% verloren",null,null,null,{"$f":"IF(F16=0,0,F19/F16)","v":0.2},null,"Hondsberg (Rosmalen)"]
[null,"Wedstrijdpunten",null,null,null,{"$f":"SUM(H32:H57)","v":11}]
[null,"Saldopunten",null,null,null,{"$f":"SUM(I32:I57)","v":30}]
[null,"Saldopunten per wedstrijd",null,null,null,{"$f":"IF(F16=0,0,F24/F16)","v":6}]
[]
[]
[null,"LET OP: alleen wedstrijden die daadwerkelijk gespeeld zijn in de wijk waarvoor jij je hebt ingeschreven tellen mee!"]
[]
[]
[null,"Datum","Locatie","UITSLAGEN",null,null,"W, V of G?","Wedstrijd-punten","Saldo-punten"]
[null,"2021-06-15","Hondsberg (Rosmalen)",12,"-",2,{"$f":"IF(OR($B$13=\"\",wijk_van_inschrijving=\"\"),\"-\",IF(OR(wijk_van_inschrijving<>C32,D32=\"\",F32=\"\"),\"-\",IF(D32>F32,\"W\",IF(D32=F32,\"G\",IF(D32<F32,\"V\",\"-\")))))","v":"W"},{"$f":"IF(OR($B$13=\"\",wijk_van_inschrijving=\"\"),\"-\",IF(OR(wijk_van_inschrijving<>C32,G32=\"-\",G32=\"\"),\"-\",IF(G32=\"W\",3,IF(G32=\"G\",2,IF(G32=\"V\",0,0)))))","v":3},{"$f":"IF(OR($B$13=\"\",wijk_van_inschrijving=\"\"),\"-\",IF(wijk_van_inschrijving<>C32,\"-\",IF(D32>=0,IF(F32=\"\",\"-\",D32-F32))))","v":10}]
[null,"2021-06-15","Hondsberg (Rosmalen)",5,"-",8,"V",0,-3]
[null,"2021-06-15","Hondsberg (Rosmalen)",8,"-",8,"G",2,0]
[null,"2021-06-30","Hondsberg (Rosmalen)",13,"-",2,"W",3,11]
[null,"2021-06-30","Hondsberg (Rosmalen)",12,"-",0,"W",3,12]
[null,null,null,null,"-",null,"-","-","-"]
[null,null,null,null,"-",null,"-","-","-"]
[null,null,null,null,"-",null,"-","-","-"]
[null,null,null,null,"-",null,"-","-","-"]
[null,null,null,null,"-",null,"-","-","-"]
[null,null,null,null,"-",null,"-","-","-"]
[null,null,null,null,"-",null,"-","-","-"]
[null,null,null,null,"-",null,"-","-","-"]
[null,null,null,null,"-",null,"-","-","-"]
[null,null,null,null,"-",null,"-","-","-"]
[null,null,null,null,"-",null,"-","-","-"]
[null,null,null,null,"-",null,"-","-","-"]
[null,null,null,null,"-",null,"-","-","-"]
[null,null,null,null,"-",null,"-","-","-"]
[null,null,null,null,"-",null,"-","-","-"]
[null,null,null,null,"-",null,"-","-","-"]
[null,null,null,null,"-",null,"-","-","-"]
[null,null,null,null,"-",null,"-","-","-"]
[null,null,null,null,"-",null,"-","-","-"]
[null,null,null,null,"-",null,"-","-","-"]

{"sheet":"Tiny Smits","index":102,"n_rows":56,"n_cols":9,"rows_kept":56,"cut":false,"hidden":false,"merged":[[19,1,19,4],[12,1,12,8],[15,1,15,4],[16,1,16,4],[17,1,17,4],[18,1,18,4],[18,7,20,8],[27,1,27,8],[30,3,30,5],[20,1,20,4],[21,7,21,8],[21,1,21,4],[22,1,22,4],[23,1,23,4],[24,1,24,4]]}
[]
[]
[]
[]
[]
[]
[]
[]
[]
[]
[]
[]
[null,"Tiny Smits"]
[]
[]
[null,"Gespeeld",null,null,null,{"$f":"COUNTIF(G32:G57,\"W\")+COUNTIF(G32:G57,\"G\")+COUNTIF(G32:G57,\"V\")","v":6}]
[null,"Gewonnen",null,null,null,{"$f":"COUNTIF(G32:G57,\"W\")","v":3}]
[null,"Gelijk",null,null,null,{"$f":"COUNTIF(G32:G57,\"G\")","v":0}]
[null,"Verloren",null,null,null,{"$f":"COUNTIF(G32:G57,\"V\")","v":3},null,"Wijk van initiële inschrijving\n(met shirtkleur finaledag)"]
[null,"% gewonnen",null,null,null,{"$f":"IF(F16=0,0,F17/F16)","v":0.5}]
[null,"% gelijk",null,null,null,{"$f":"IF(F16=0,0,F18/F16)","v":0}]
[null,"% verloren",null,null,null,{"$f":"IF(F16=0,0,F19/F16)","v":0.5},null,"De Hambaken"]
[null,"Wedstrijdpunten",null,null,null,{"$f":"SUM(H32:H57)","v":9}]
[null,"Saldopunten",null,null,null,{"$f":"SUM(I32:I57)","v":-15}]
[null,"Saldopunten per wedstrijd",null,null,null,{"$f":"IF(F16=0,0,F24/F16)","v":-2.5}]
[]
[]
[null,"LET OP: alleen wedstrijden die daadwerkelijk gespeeld zijn in de wijk waarvoor jij je hebt ingeschreven tellen mee!"]
[]
[]
[null,"Datum","Locatie","UITSLAGEN",null,null,"W, V of G?","Wedstrijd-punten","Saldo-punten"]
[null,"2021-06-29","De Hambaken",3,"-",13,{"$f":"IF(OR($B$13=\"\",wijk_van_inschrijving=\"\"),\"-\",IF(OR(wijk_van_inschrijving<>C32,D32=\"\",F32=\"\"),\"-\",IF(D32>F32,\"W\",IF(D32=F32,\"G\",IF(D32<F32,\"V\",\"-\")))))","v":"V"},{"$f":"IF(OR($B$13=\"\",wijk_van_inschrijving=\"\"),\"-\",IF(OR(wijk_van_inschrijving<>C32,G32=\"-\",G32=\"\"),\"-\",IF(G32=\"W\",3,IF(G32=\"G\",2,IF(G32=\"V\",0,0)))))","v":0},{"$f":"IF(OR($B$13=\"\",wijk_van_inschrijving=\"\"),\"-\",IF(wijk_van_inschrijving<>C32,\"-\",IF(D32>=0,IF(F32=\"\",\"-\",D32-F32))))","v":-10}]
[null,"2021-06-29","De Hambaken",2,"-",13,"V",0,-11]
[null,"2021-06-29","De Hambaken",13,"-",12,"W",3,1]
[null,"2021-07-06","De Hambaken",13,"-",11,"W",3,2]
[null,"2021-07-06","De Hambaken",9,"-",3,"W",3,6]
[null,"2021-07-06","De Hambaken",6,"-",9,"V",0,-3]
[null,null,null,null,"-",null,"-","-","-"]
[null,null,null,null,"-",null,"-","-","-"]
[null,null,null,null,"-",null,"-","-","-"]
[null,null,null,null,"-",null,"-","-","-"]
[null,null,null,null,"-",null,"-","-","-"]
[null,null,null,null,"-",null,"-","-","-"]
[null,null,null,null,"-",null,"-","-","-"]
[null,null,null,null,"-",null,"-","-","-"]
[null,null,null,null,"-",null,"-","-","-"]
[null,null,null,null,"-",null,"-","-","-"]
[null,null,null,null,"-",null,"-","-","-"]
[null,null,null,null,"-",null,"-","-","-"]
[null,null,null,null,"-",null,"-","-","-"]
[null,null,null,null,"-",null,"-","-","-"]
[null,null,null,null,"-",null,"-","-","-"]
[null,null,null,null,"-",null,"-","-","-"]
[null,null,null,null,"-",null,"-","-","-"]
[null,null,null,null,"-",null,"-","-","-"]
[null,null,null,null,"-",null,"-","-","-"]

{"sheet":"Ton van der Wel","index":103,"n_rows":56,"n_cols":9,"rows_kept":56,"cut":false,"hidden":false,"merged":[[18,7,20,8],[30,3,30,5],[12,1,12,8],[15,1,15,4],[16,1,16,4],[17,1,17,4],[18,1,18,4],[19,1,19,4],[20,1,20,4],[21,1,21,4],[22,1,22,4],[23,1,23,4],[24,1,24,4],[21,7,21,8],[27,1,27,8]]}
[]
[]
[]
[]
[]
[]
[]
[]
[]
[]
[]
[]
[null,"Ton van der Wel"]
[]
[]
[null,"Gespeeld",null,null,null,{"$f":"COUNTIF(G32:G57,\"W\")+COUNTIF(G32:G57,\"G\")+COUNTIF(G32:G57,\"V\")","v":3}]
[null,"Gewonnen",null,null,null,{"$f":"COUNTIF(G32:G57,\"W\")","v":2}]
[null,"Gelijk",null,null,null,{"$f":"COUNTIF(G32:G57,\"G\")","v":0}]
[null,"Verloren",null,null,null,{"$f":"COUNTIF(G32:G57,\"V\")","v":1},null,"Wijk van initiële inschrijving\n(met shirtkleur finaledag)"]
[null,"% gewonnen",null,null,null,{"$f":"IF(F16=0,0,F17/F16)","v":0.66666666666666663}]
[null,"% gelijk",null,null,null,{"$f":"IF(F16=0,0,F18/F16)","v":0}]
[null,"% verloren",null,null,null,{"$f":"IF(F16=0,0,F19/F16)","v":0.33333333333333331},null,"De Schutskamp"]
[null,"Wedstrijdpunten",null,null,null,{"$f":"SUM(H32:H57)","v":6}]
[null,"Saldopunten",null,null,null,{"$f":"SUM(I32:I57)","v":15}]
[null,"Saldopunten per wedstrijd",null,null,null,{"$f":"IF(F16=0,0,F24/F16)","v":5}]
[]
[]
[null,"LET OP: alleen wedstrijden die daadwerkelijk gespeeld zijn in de wijk waarvoor jij je hebt ingeschreven tellen mee!"]
[]
[]
[null,"Datum","Locatie","UITSLAGEN",null,null,"W, V of G?","Wedstrijd-punten","Saldo-punten"]
[null,"2021-06-14","De Schutskamp",13,"-",0,{"$f":"IF(OR($B$13=\"\",wijk_van_inschrijving=\"\"),\"-\",IF(OR(wijk_van_inschrijving<>C32,D32=\"\",F32=\"\"),\"-\",IF(D32>F32,\"W\",IF(D32=F32,\"G\",IF(D32<F32,\"V\",\"-\")))))","v":"W"},{"$f":"IF(OR($B$13=\"\",wijk_van_inschrijving=\"\"),\"-\",IF(OR(wijk_van_inschrijving<>C32,G32=\"-\",G32=\"\"),\"-\",IF(G32=\"W\",3,IF(G32=\"G\",2,IF(G32=\"V\",0,0)))))","v":3},{"$f":"IF(OR($B$13=\"\",wijk_van_inschrijving=\"\"),\"-\",IF(wijk_van_inschrijving<>C32,\"-\",IF(D32>=0,IF(F32=\"\",\"-\",D32-F32))))","v":13}]
[null,"2021-06-14","De Schutskamp",4,"-",7,"V",0,-3]
[null,"2021-06-14","De Schutskamp",9,"-",4,"W",3,5]
[null,null,null,null,"-",null,"-","-","-"]
[null,null,null,null,"-",null,"-","-","-"]
[null,null,null,null,"-",null,"-","-","-"]
[null,null,null,null,"-",null,"-","-","-"]
[null,null,null,null,"-",null,"-","-","-"]
[null,null,null,null,"-",null,"-","-","-"]
[null,null,null,null,"-",null,"-","-","-"]
[null,null,null,null,"-",null,"-","-","-"]
[null,null,null,null,"-",null,"-","-","-"]
[null,null,null,null,"-",null,"-","-","-"]
[null,null,null,null,"-",null,"-","-","-"]
[null,null,null,null,"-",null,"-","-","-"]
[null,null,null,null,"-",null,"-","-","-"]
[null,null,null,null,"-",null,"-","-","-"]
[null,null,null,null,"-",null,"-","-","-"]
[null,null,null,null,"-",null,"-","-","-"]
[null,null,null,null,"-",null,"-","-","-"]
[null,null,null,null,"-",null,"-","-","-"]
[null,null,null,null,"-",null,"-","-","-"]
[null,null,null,null,"-",null,"-","-","-"]
[null,null,null,null,"-",null,"-","-","-"]
[null,null,null,null,"-",null,"-","-","-"]

{"sheet":"Ton van Huijstee","index":104,"n_rows":56,"n_cols":9,"rows_kept":56,"cut":false,"hidden":false,"merged":[[18,7,20,8],[30,3,30,5],[12,1,12,8],[15,1,15,4],[16,1,16,4],[17,1,17,4],[18,1,18,4],[19,1,19,4],[20,1,20,4],[21,1,21,4],[22,1,22,4],[23,1,23,4],[24,1,24,4],[21,7,21,8],[27,1,27,8]]}
[]
[]
[]
[]
[]
[]
[]
[]
[]
[]
[]
[]
[null,"Ton van Huijstee"]
[]
[]
[null,"Gespeeld",null,null,null,{"$f":"COUNTIF(G32:G57,\"W\")+COUNTIF(G32:G57,\"G\")+COUNTIF(G32:G57,\"V\")","v":3}]
[null,"Gewonnen",null,null,null,{"$f":"COUNTIF(G32:G57,\"W\")","v":0}]
[null,"Gelijk",null,null,null,{"$f":"COUNTIF(G32:G57,\"G\")","v":0}]
[null,"Verloren",null,null,null,{"$f":"COUNTIF(G32:G57,\"V\")","v":3},null,"Wijk van initiële inschrijving\n(met shirtkleur finaledag)"]
[null,"% gewonnen",null,null,null,{"$f":"IF(F16=0,0,F17/F16)","v":0}]
[null,"% gelijk",null,null,null,{"$f":"IF(F16=0,0,F18/F16)","v":0}]
[null,"% verloren",null,null,null,{"$f":"IF(F16=0,0,F19/F16)","v":1},null,"De Hambaken"]
[null,"Wedstrijdpunten",null,null,null,{"$f":"SUM(H32:H57)","v":0}]
[null,"Saldopunten",null,null,null,{"$f":"SUM(I32:I57)","v":-7}]
[null,"Saldopunten per wedstrijd",null,null,null,{"$f":"IF(F16=0,0,F24/F16)","v":-2.3333333333333335}]
[]
[]
[null,"LET OP: alleen wedstrijden die daadwerkelijk gespeeld zijn in de wijk waarvoor jij je hebt ingeschreven tellen mee!"]
[]
[]
[null,"Datum","Locatie","UITSLAGEN",null,null,"W, V of G?","Wedstrijd-punten","Saldo-punten"]
[null,"2021-06-16","De Hambaken",4,"-",9,{"$f":"IF(OR($B$13=\"\",wijk_van_inschrijving=\"\"),\"-\",IF(OR(wijk_van_inschrijving<>C32,D32=\"\",F32=\"\"),\"-\",IF(D32>F32,\"W\",IF(D32=F32,\"G\",IF(D32<F32,\"V\",\"-\")))))","v":"V"},{"$f":"IF(OR($B$13=\"\",wijk_van_inschrijving=\"\"),\"-\",IF(OR(wijk_van_inschrijving<>C32,G32=\"-\",G32=\"\"),\"-\",IF(G32=\"W\",3,IF(G32=\"G\",2,IF(G32=\"V\",0,0)))))","v":0},{"$f":"IF(OR($B$13=\"\",wijk_van_inschrijving=\"\"),\"-\",IF(wijk_van_inschrijving<>C32,\"-\",IF(D32>=0,IF(F32=\"\",\"-\",D32-F32))))","v":-5}]
[null,"2021-06-16","De Hambaken",6,"-",7,"V",0,-1]
[null,"2021-06-16","De Hambaken",6,"-",7,"V",0,-1]
[null,null,null,null,"-",null,"-","-","-"]
[null,null,null,null,"-",null,"-","-","-"]
[null,null,null,null,"-",null,"-","-","-"]
[null,null,null,null,"-",null,"-","-","-"]
[null,null,null,null,"-",null,"-","-","-"]
[null,null,null,null,"-",null,"-","-","-"]
[null,null,null,null,"-",null,"-","-","-"]
[null,null,null,null,"-",null,"-","-","-"]
[null,null,null,null,"-",null,"-","-","-"]
[null,null,null,null,"-",null,"-","-","-"]
[null,null,null,null,"-",null,"-","-","-"]
[null,null,null,null,"-",null,"-","-","-"]
[null,null,null,null,"-",null,"-","-","-"]
[null,null,null,null,"-",null,"-","-","-"]
[null,null,null,null,"-",null,"-","-","-"]
[null,null,null,null,"-",null,"-","-","-"]
[null,null,null,null,"-",null,"-","-","-"]
[null,null,null,null,"-",null,"-","-","-"]
[null,null,null,null,"-",null,"-","-","-"]
[null,null,null,null,"-",null,"-","-","-"]
[null,null,null,null,"-",null,"-","-","-"]
[null,null,null,null,"-",null,"-","-","-"]

{"sheet":"Vera Beunk - Veeken","index":105,"n_rows":56,"n_cols":9,"rows_kept":56,"cut":false,"hidden":false,"merged":[[19,1,19,4],[12,1,12,8],[15,1,15,4],[16,1,16,4],[17,1,17,4],[18,1,18,4],[18,7,20,8],[27,1,27,8],[30,3,30,5],[20,1,20,4],[21,7,21,8],[21,1,21,4],[22,1,22,4],[23,1,23,4],[24,1,24,4]]}
[]
[]
[]
[]
[]
[]
[]
[]
[]
[]
[]
[]
[null,"Vera Beunk - Veeken"]
[]
[]
[null,"Gespeeld",null,null,null,{"$f":"COUNTIF(G32:G57,\"W\")+COUNTIF(G32:G57,\"G\")+COUNTIF(G32:G57,\"V\")","v":9}]
[null,"Gewonnen",null,null,null,{"$f":"COUNTIF(G32:G57,\"W\")","v":7}]
[null,"Gelijk",null,null,null,{"$f":"COUNTIF(G32:G57,\"G\")","v":0}]
[null,"Verloren",null,null,null,{"$f":"COUNTIF(G32:G57,\"V\")","v":2},null,"Wijk van initiële inschrijving\n(met shirtkleur finaledag)"]
[null,"% gewonnen",null,null,null,{"$f":"IF(F16=0,0,F17/F16)","v":0.77777777777777779}]
[null,"% gelijk",null,null,null,{"$f":"IF(F16=0,0,F18/F16)","v":0}]
[null,"% verloren",null,null,null,{"$f":"IF(F16=0,0,F19/F16)","v":0.22222222222222221},null,"De Hambaken"]
[null,"Wedstrijdpunten",null,null,null,{"$f":"SUM(H32:H57)","v":21}]
[null,"Saldopunten",null,null,null,{"$f":"SUM(I32:I57)","v":25}]
[null,"Saldopunten per wedstrijd",null,null,null,{"$f":"IF(F16=0,0,F24/F16)","v":2.7777777777777777}]
[]
[]
[null,"LET OP: alleen wedstrijden die daadwerkelijk gespeeld zijn in de wijk waarvoor jij je hebt ingeschreven tellen mee!"]
[]
[]
[null,"Datum","Locatie","UITSLAGEN",null,null,"W, V of G?","Wedstrijd-punten","Saldo-punten"]
[null,"2021-06-23","De Hambaken",13,"-",8,{"$f":"IF(OR($B$13=\"\",wijk_van_inschrijving=\"\"),\"-\",IF(OR(wijk_van_inschrijving<>C32,D32=\"\",F32=\"\"),\"-\",IF(D32>F32,\"W\",IF(D32=F32,\"G\",IF(D32<F32,\"V\",\"-\")))))","v":"W"},{"$f":"IF(OR($B$13=\"\",wijk_van_inschrijving=\"\"),\"-\",IF(OR(wijk_van_inschrijving<>C32,G32=\"-\",G32=\"\"),\"-\",IF(G32=\"W\",3,IF(G32=\"G\",2,IF(G32=\"V\",0,0)))))","v":3},{"$f":"IF(OR($B$13=\"\",wijk_van_inschrijving=\"\"),\"-\",IF(wijk_van_inschrijving<>C32,\"-\",IF(D32>=0,IF(F32=\"\",\"-\",D32-F32))))","v":5}]
[null,"2021-06-23","De Hambaken",9,"-",4,"W",3,5]
[null,"2021-06-23","De Hambaken",12,"-",5,"W",3,7]
[null,"2021-06-29","De Hambaken",13,"-",3,"W",3,10]
[null,"2021-06-29","De Hambaken",8,"-",2,"W",3,6]
[null,"2021-06-29","De Hambaken",4,"-",13,"V",0,-9]
[null,"2021-07-06","De Hambaken",5,"-",13,"V",0,-8]
[null,"2021-07-06","De Hambaken",9,"-",3,"W",3,6]
[null,"2021-07-06","De Hambaken",9,"-",6,"W",3,3]
[null,null,null,null,"-",null,"-","-","-"]
[null,null,null,null,"-",null,"-","-","-"]
[null,null,null,null,"-",null,"-","-","-"]
[null,null,null,null,"-",null,"-","-","-"]
[null,null,null,null,"-",null,"-","-","-"]
[null,null,null,null,"-",null,"-","-","-"]
[null,null,null,null,"-",null,"-","-","-"]
[null,null,null,null,"-",null,"-","-","-"]
[null,null,null,null,"-",null,"-","-","-"]
[null,null,null,null,"-",null,"-","-","-"]
[null,null,null,null,"-",null,"-","-","-"]
[null,null,null,null,"-",null,"-","-","-"]
[null,null,null,null,"-",null,"-","-","-"]
[null,null,null,null,"-",null,"-","-","-"]
[null,null,null,null,"-",null,"-","-","-"]
[null,null,null,null,"-",null,"-","-","-"]

{"sheet":"Willem Hartman","index":106,"n_rows":56,"n_cols":9,"rows_kept":56,"cut":false,"hidden":false,"merged":[[27,1,27,8],[30,3,30,5],[20,1,20,4],[21,7,21,8],[21,1,21,4],[22,1,22,4],[23,1,23,4],[24,1,24,4],[18,7,20,8],[19,1,19,4],[12,1,12,8],[15,1,15,4],[16,1,16,4],[17,1,17,4],[18,1,18,4]]}
[]
[]
[]
[]
[]
[]
[]
[]
[]
[]
[]
[]
[null,"Willem Hartman"]
[]
[]
[null,"Gespeeld",null,null,null,{"$f":"COUNTIF(G32:G57,\"W\")+COUNTIF(G32:G57,\"G\")+COUNTIF(G32:G57,\"V\")","v":5}]
[null,"Gewonnen",null,null,null,{"$f":"COUNTIF(G32:G57,\"W\")","v":4}]
[null,"Gelijk",null,null,null,{"$f":"COUNTIF(G32:G57,\"G\")","v":1}]
[null,"Verloren",null,null,null,{"$f":"COUNTIF(G32:G57,\"V\")","v":0},null,"Wijk van initiële inschrijving\n(met shirtkleur finaledag)"]
[null,"% gewonnen",null,null,null,{"$f":"IF(F16=0,0,F17/F16)","v":0.8}]
[null,"% gelijk",null,null,null,{"$f":"IF(F16=0,0,F18/F16)","v":0.2}]
[null,"% verloren",null,null,null,{"$f":"IF(F16=0,0,F19/F16)","v":0},null,"De Schutskamp"]
[null,"Wedstrijdpunten",null,null,null,{"$f":"SUM(H32:H57)","v":14}]
[null,"Saldopunten",null,null,null,{"$f":"SUM(I32:I57)","v":17}]
[null,"Saldopunten per wedstrijd",null,null,null,{"$f":"IF(F16=0,0,F24/F16)","v":3.4}]
[]
[]
[null,"LET OP: alleen wedstrijden die daadwerkelijk gespeeld zijn in de wijk waarvoor jij je hebt ingeschreven tellen mee!"]
[]
[]
[null,"Datum","Locatie","UITSLAGEN",null,null,"W, V of G?","Wedstrijd-punten","Saldo-punten"]
[null,"2021-06-24","De Schutskamp",10,"-",6,{"$f":"IF(OR($B$13=\"\",wijk_van_inschrijving=\"\"),\"-\",IF(OR(wijk_van_inschrijving<>C32,D32=\"\",F32=\"\"),\"-\",IF(D32>F32,\"W\",IF(D32=F32,\"G\",IF(D32<F32,\"V\",\"-\")))))","v":"W"},{"$f":"IF(OR($B$13=\"\",wijk_van_inschrijving=\"\"),\"-\",IF(OR(wijk_van_inschrijving<>C32,G32=\"-\",G32=\"\"),\"-\",IF(G32=\"W\",3,IF(G32=\"G\",2,IF(G32=\"V\",0,0)))))","v":3},{"$f":"IF(OR($B$13=\"\",wijk_van_inschrijving=\"\"),\"-\",IF(wijk_van_inschrijving<>C32,\"-\",IF(D32>=0,IF(F32=\"\",\"-\",D32-F32))))","v":4}]
[null,"2021-06-24","De Schutskamp",9,"-",6,"W",3,3]
[null,"2021-06-24","De Schutskamp",11,"-",11,"G",2,0]
[null,"2021-06-28","De Schutskamp",13,"-",4,"W",3,9]
[null,"2021-06-28","De Schutskamp",8,"-",7,"W",3,1]
[null,null,null,null,"-",null,"-","-","-"]
[null,null,null,null,"-",null,"-","-","-"]
[null,null,null,null,"-",null,"-","-","-"]
[null,null,null,null,"-",null,"-","-","-"]
[null,null,null,null,"-",null,"-","-","-"]
[null,null,null,null,"-",null,"-","-","-"]
[null,null,null,null,"-",null,"-","-","-"]
[null,null,null,null,"-",null,"-","-","-"]
[null,null,null,null,"-",null,"-","-","-"]
[null,null,null,null,"-",null,"-","-","-"]
[null,null,null,null,"-",null,"-","-","-"]
[null,null,null,null,"-",null,"-","-","-"]
[null,null,null,null,"-",null,"-","-","-"]
[null,null,null,null,"-",null,"-","-","-"]
[null,null,null,null,"-",null,"-","-","-"]
[null,null,null,null,"-",null,"-","-","-"]
[null,null,null,null,"-",null,"-","-","-"]
[null,null,null,null,"-",null,"-","-","-"]
[null,null,null,null,"-",null,"-","-","-"]
[null,null,null,null,"-",null,"-","-","-"]

{"sheet":"Willem Warnaar","index":107,"n_rows":56,"n_cols":9,"rows_kept":56,"cut":false,"hidden":false,"merged":[[18,7,20,8],[30,3,30,5],[12,1,12,8],[15,1,15,4],[16,1,16,4],[17,1,17,4],[18,1,18,4],[19,1,19,4],[20,1,20,4],[21,1,21,4],[22,1,22,4],[23,1,23,4],[24,1,24,4],[21,7,21,8],[27,1,27,8]]}
[]
[]
[]
[]
[]
[]
[]
[]
[]
[]
[]
[]
[null,"Willem Warnaar"]
[]
[]
[null,"Gespeeld",null,null,null,{"$f":"COUNTIF(G32:G57,\"W\")+COUNTIF(G32:G57,\"G\")+COUNTIF(G32:G57,\"V\")","v":9}]
[null,"Gewonnen",null,null,null,{"$f":"COUNTIF(G32:G57,\"W\")","v":3}]
[null,"Gelijk",null,null,null,{"$f":"COUNTIF(G32:G57,\"G\")","v":0}]
[null,"Verloren",null,null,null,{"$f":"COUNTIF(G32:G57,\"V\")","v":6},null,"Wijk van initiële inschrijving\n(met shirtkleur finaledag)"]
[null,"% gewonnen",null,null,null,{"$f":"IF(F16=0,0,F17/F16)","v":0.33333333333333331}]
[null,"% gelijk",null,null,null,{"$f":"IF(F16=0,0,F18/F16)","v":0}]
[null,"% verloren",null,null,null,{"$f":"IF(F16=0,0,F19/F16)","v":0.66666666666666663},null,"De Schutskamp"]
[null,"Wedstrijdpunten",null,null,null,{"$f":"SUM(H32:H57)","v":9}]
[null,"Saldopunten",null,null,null,{"$f":"SUM(I32:I57)","v":-13}]
[null,"Saldopunten per wedstrijd",null,null,null,{"$f":"IF(F16=0,0,F24/F16)","v":-1.4444444444444444}]
[]
[]
[null,"LET OP: alleen wedstrijden die daadwerkelijk gespeeld zijn in de wijk waarvoor jij je hebt ingeschreven tellen mee!"]
[]
[]
[null,"Datum","Locatie","UITSLAGEN",null,null,"W, V of G?","Wedstrijd-punten","Saldo-punten"]
[null,"2021-06-14","De Schutskamp",7,"-",13,{"$f":"IF(OR($B$13=\"\",wijk_van_inschrijving=\"\"),\"-\",IF(OR(wijk_van_inschrijving<>C32,D32=\"\",F32=\"\"),\"-\",IF(D32>F32,\"W\",IF(D32=F32,\"G\",IF(D32<F32,\"V\",\"-\")))))","v":"V"},{"$f":"IF(OR($B$13=\"\",wijk_van_inschrijving=\"\"),\"-\",IF(OR(wijk_van_inschrijving<>C32,G32=\"-\",G32=\"\"),\"-\",IF(G32=\"W\",3,IF(G32=\"G\",2,IF(G32=\"V\",0,0)))))","v":0},{"$f":"IF(OR($B$13=\"\",wijk_van_inschrijving=\"\"),\"-\",IF(wijk_van_inschrijving<>C32,\"-\",IF(D32>=0,IF(F32=\"\",\"-\",D32-F32))))","v":-6}]
[null,"2021-06-14","De Schutskamp",0,"-",13,"V",0,-13]
[null,"2021-06-14","De Schutskamp",13,"-",5,"W",3,8]
[null,"2021-06-24","De Schutskamp",8,"-",6,"W",3,2]
[null,"2021-06-24","De Schutskamp",13,"-",3,"W",3,10]
[null,"2021-06-24","De Schutskamp",8,"-",9,"V",0,-1]
[null,"2021-06-28","De Schutskamp",8,"-",13,"V",0,-5]
[null,"2021-06-28","De Schutskamp",3,"-",5,"V",0,-2]
[null,"2021-06-28","De Schutskamp",6,"-",12,"V",0,-6]
[null,null,null,null,"-",null,"-","-","-"]
[null,null,null,null,"-",null,"-","-","-"]
[null,null,null,null,"-",null,"-","-","-"]
[null,null,null,null,"-",null,"-","-","-"]
[null,null,null,null,"-",null,"-","-","-"]
[null,null,null,null,"-",null,"-","-","-"]
[null,null,null,null,"-",null,"-","-","-"]
[null,null,null,null,"-",null,"-","-","-"]
[null,null,null,null,"-",null,"-","-","-"]
[null,null,null,null,"-",null,"-","-","-"]
[null,null,null,null,"-",null,"-","-","-"]
[null,null,null,null,"-",null,"-","-","-"]
[null,null,null,null,"-",null,"-","-","-"]
[null,null,null,null,"-",null,"-","-","-"]
[null,null,null,null,"-",null,"-","-","-"]
[null,null,null,null,"-",null,"-","-","-"]

{"sheet":"Willy van der Wielen","index":108,"n_rows":56,"n_cols":9,"rows_kept":56,"cut":false,"hidden":false,"merged":[[27,1,27,8],[30,3,30,5],[20,1,20,4],[21,7,21,8],[21,1,21,4],[22,1,22,4],[23,1,23,4],[24,1,24,4],[18,7,20,8],[19,1,19,4],[12,1,12,8],[15,1,15,4],[16,1,16,4],[17,1,17,4],[18,1,18,4]]}
[]
[]
[]
[]
[]
[]
[]
[]
[]
[]
[]
[]
[null,"Willy van der Wielen"]
[]
[]
[null,"Gespeeld",null,null,null,{"$f":"COUNTIF(G32:G57,\"W\")+COUNTIF(G32:G57,\"G\")+COUNTIF(G32:G57,\"V\")","v":6}]
[null,"Gewonnen",null,null,null,{"$f":"COUNTIF(G32:G57,\"W\")","v":1}]
[null,"Gelijk",null,null,null,{"$f":"COUNTIF(G32:G57,\"G\")","v":0}]
[null,"Verloren",null,null,null,{"$f":"COUNTIF(G32:G57,\"V\")","v":5},null,"Wijk van initiële inschrijving\n(met shirtkleur finaledag)"]
[null,"% gewonnen",null,null,null,{"$f":"IF(F16=0,0,F17/F16)","v":0.16666666666666666}]
[null,"% gelijk",null,null,null,{"$f":"IF(F16=0,0,F18/F16)","v":0}]
[null,"% verloren",null,null,null,{"$f":"IF(F16=0,0,F19/F16)","v":0.83333333333333337},null,"De Hambaken"]
[null,"Wedstrijdpunten",null,null,null,{"$f":"SUM(H32:H57)","v":3}]
[null,"Saldopunten",null,null,null,{"$f":"SUM(I32:I57)","v":-37}]
[null,"Saldopunten per wedstrijd",null,null,null,{"$f":"IF(F16=0,0,F24/F16)","v":-6.166666666666667}]
[]
[]
[null,"LET OP: alleen wedstrijden die daadwerkelijk gespeeld zijn in de wijk waarvoor jij je hebt ingeschreven tellen mee!"]
[]
[]
[null,"Datum","Locatie","UITSLAGEN",null,null,"W, V of G?","Wedstrijd-punten","Saldo-punten"]
[null,"2021-06-29","De Hambaken",3,"-",13,{"$f":"IF(OR($B$13=\"\",wijk_van_inschrijving=\"\"),\"-\",IF(OR(wijk_van_inschrijving<>C32,D32=\"\",F32=\"\"),\"-\",IF(D32>F32,\"W\",IF(D32=F32,\"G\",IF(D32<F32,\"V\",\"-\")))))","v":"V"},{"$f":"IF(OR($B$13=\"\",wijk_van_inschrijving=\"\"),\"-\",IF(OR(wijk_van_inschrijving<>C32,G32=\"-\",G32=\"\"),\"-\",IF(G32=\"W\",3,IF(G32=\"G\",2,IF(G32=\"V\",0,0)))))","v":0},{"$f":"IF(OR($B$13=\"\",wijk_van_inschrijving=\"\"),\"-\",IF(wijk_van_inschrijving<>C32,\"-\",IF(D32>=0,IF(F32=\"\",\"-\",D32-F32))))","v":-10}]
[null,"2021-06-29","De Hambaken",2,"-",13,"V",0,-11]
[null,"2021-06-29","De Hambaken",4,"-",13,"V",0,-9]
[null,"2021-07-06","De Hambaken",13,"-",5,"W",3,8]
[null,"2021-07-06","De Hambaken",5,"-",13,"V",0,-8]
[null,"2021-07-06","De Hambaken",5,"-",12,"V",0,-7]
[null,null,null,null,"-",null,"-","-","-"]
[null,null,null,null,"-",null,"-","-","-"]
[null,null,null,null,"-",null,"-","-","-"]
[null,null,null,null,"-",null,"-","-","-"]
[null,null,null,null,"-",null,"-","-","-"]
[null,null,null,null,"-",null,"-","-","-"]
[null,null,null,null,"-",null,"-","-","-"]
[null,null,null,null,"-",null,"-","-","-"]
[null,null,null,null,"-",null,"-","-","-"]
[null,null,null,null,"-",null,"-","-","-"]
[null,null,null,null,"-",null,"-","-","-"]
[null,null,null,null,"-",null,"-","-","-"]
[null,null,null,null,"-",null,"-","-","-"]
[null,null,null,null,"-",null,"-","-","-"]
[null,null,null,null,"-",null,"-","-","-"]
[null,null,null,null,"-",null,"-","-","-"]
[null,null,null,null,"-",null,"-","-","-"]
[null,null,null,null,"-",null,"-","-","-"]
[null,null,null,null,"-",null,"-","-","-"]

{"sheet":"xxx","index":109,"n_rows":56,"n_cols":9,"rows_kept":56,"cut":false,"hidden":false,"merged":[[18,7,20,8],[30,3,30,5],[12,1,12,8],[15,1,15,4],[16,1,16,4],[17,1,17,4],[18,1,18,4],[19,1,19,4],[20,1,20,4],[21,1,21,4],[22,1,22,4],[23,1,23,4],[24,1,24,4],[21,7,21,8],[27,1,27,8]]}
[]
[]
[]
[]
[]
[]
[]
[]
[]
[]
[]
[]
[]
[]
[]
[null,"Gespeeld",null,null,null,{"$f":"COUNTIF(G32:G57,\"W\")+COUNTIF(G32:G57,\"G\")+COUNTIF(G32:G57,\"V\")","v":0}]
[null,"Gewonnen",null,null,null,{"$f":"COUNTIF(G32:G57,\"W\")","v":0}]
[null,"Gelijk",null,null,null,{"$f":"COUNTIF(G32:G57,\"G\")","v":0}]
[null,"Verloren",null,null,null,{"$f":"COUNTIF(G32:G57,\"V\")","v":0},null,"Wijk van initiële inschrijving\n(met shirtkleur finaledag)"]
[null,"% gewonnen",null,null,null,{"$f":"IF(F16=0,0,F17/F16)","v":0}]
[null,"% gelijk",null,null,null,{"$f":"IF(F16=0,0,F18/F16)","v":0}]
[null,"% verloren",null,null,null,{"$f":"IF(F16=0,0,F19/F16)","v":0}]
[null,"Wedstrijdpunten",null,null,null,{"$f":"SUM(H32:H57)","v":0}]
[null,"Saldopunten",null,null,null,{"$f":"SUM(I32:I57)","v":0}]
[null,"Saldopunten per wedstrijd",null,null,null,{"$f":"IF(F16=0,0,F24/F16)","v":0}]
[]
[]
[null,"LET OP: alleen wedstrijden die daadwerkelijk gespeeld zijn in de wijk waarvoor jij je hebt ingeschreven tellen mee!"]
[]
[]
[null,"Datum","Locatie","UITSLAGEN",null,null,"W, V of G?","Wedstrijd-punten","Saldo-punten"]
[null,null,null,null,"-",null,{"$f":"IF(OR($B$13=\"\",wijk_van_inschrijving=\"\"),\"-\",IF(OR(wijk_van_inschrijving<>C32,D32=\"\",F32=\"\"),\"-\",IF(D32>F32,\"W\",IF(D32=F32,\"G\",IF(D32<F32,\"V\",\"-\")))))","v":"-"},{"$f":"IF(OR($B$13=\"\",wijk_van_inschrijving=\"\"),\"-\",IF(OR(wijk_van_inschrijving<>C32,G32=\"-\",G32=\"\"),\"-\",IF(G32=\"W\",3,IF(G32=\"G\",2,IF(G32=\"V\",0,0)))))","v":"-"},{"$f":"IF(OR($B$13=\"\",wijk_van_inschrijving=\"\"),\"-\",IF(wijk_van_inschrijving<>C32,\"-\",IF(D32>=0,IF(F32=\"\",\"-\",D32-F32))))","v":"-"}]
[null,null,null,null,"-",null,"-","-","-"]
[null,null,null,null,"-",null,"-","-","-"]
[null,null,null,null,"-",null,"-","-","-"]
[null,null,null,null,"-",null,"-","-","-"]
[null,null,null,null,"-",null,"-","-","-"]
[null,null,null,null,"-",null,"-","-","-"]
[null,null,null,null,"-",null,"-","-","-"]
[null,null,null,null,"-",null,"-","-","-"]
[null,null,null,null,"-",null,"-","-","-"]
[null,null,null,null,"-",null,"-","-","-"]
[null,null,null,null,"-",null,"-","-","-"]
[null,null,null,null,"-",null,"-","-","-"]
[null,null,null,null,"-",null,"-","-","-"]
[null,null,null,null,"-",null,"-","-","-"]
[null,null,null,null,"-",null,"-","-","-"]
[null,null,null,null,"-",null,"-","-","-"]
[null,null,null,null,"-",null,"-","-","-"]
[null,null,null,null,"-",null,"-","-","-"]
[null,null,null,null,"-",null,"-","-","-"]
[null,null,null,null,"-",null,"-","-","-"]
[null,null,null,null,"-",null,"-","-","-"]
[null,null,null,null,"-",null,"-","-","-"]
[null,null,null,null,"-",null,"-","-","-"]
[null,null,null,null,"-",null,"-","-","-"]